program: Orca
programVersion: 5.0.2
elementType: O O C C C C C C C C C C C C C C C C C C H H H H H H H H H H H H H H H H H H H H H H H H H H
charge: 0
multiplicity: 1
keywords: wb97x-d3
keywords: def2-TZVPP
keywords: def2/J RIJCOSX
keywords: DEFGRID2
keywords: scfconv7
keywords: smallprint printgap noloewdin
keywords: NOSOSCF
formula: C18H26O2
InChI: InChI=1/C18H26O2/c1-13(2)18-10-9-17(4,20-18)16(11-18)19-12-15-8-6-5-7-14(15)3/h5-8,13,16H,9-12H2,1-4H3
46 atoms
O  2.645223 -0.30984 -0.167663
O  -0.165576 -1.111957 -0.789277
C  2.391766 1.091727 -0.282702
C  1.623487 -0.633417 0.772282
C  0.351705 -0.118921 0.071022
C  0.905233 1.105549 -0.688081
C  2.47888 1.565839 1.180347
C  1.922799 0.339342 1.926744
C  3.339254 1.736236 -1.284141
C  1.649029 -2.092164 1.146413
C  3.024936 3.220008 -1.44701
C  4.810547 1.537497 -0.933737
C  -1.440302 -0.806558 -1.296196
C  -2.550721 -0.967724 -0.281808
C  -3.754158 -0.264228 -0.42817
C  -2.396271 -1.840744 0.790915
C  -4.757589 -0.445991 0.520934
C  -3.979477 0.670293 -1.581524
C  -3.403616 -2.008745 1.730229
C  -4.589629 -1.30406 1.597838
H  -0.405027 0.16247 0.811691
H  0.805233 0.96309 -1.768068
H  0.400983 2.036262 -0.428872
H  1.899085 2.472663 1.352862
H  3.507409 1.775285 1.476856
H  2.669714 -0.09251 2.595257
H  1.037861 0.555254 2.526582
H  3.155132 1.248846 -2.249303
H  0.850181 -2.312412 1.856062
H  1.522542 -2.746294 0.284294
H  2.594438 -2.346469 1.629128
H  3.17951 3.769752 -0.515921
H  3.676711 3.668396 -2.198904
H  1.996746 3.392425 -1.768963
H  5.442679 1.940814 -1.727302
H  5.072394 0.485623 -0.815173
H  5.084836 2.056069 -0.013052
H  -1.610628 -1.487158 -2.136534
H  -1.459162 0.206104 -1.718142
H  -1.474256 -2.397094 0.904068
H  -5.687735 0.100135 0.413901
H  -4.981184 1.097287 -1.547166
H  -3.271087 1.502102 -1.577386
H  -3.871535 0.167222 -2.544518
H  -3.25858 -2.687516 2.561155
H  -5.382331 -1.421456 2.325887
elementType: O C H
totalener: -852.12243400 hartree
nucrepener: 1648.39996791 hartree
electener: -2500.52240191 hartree
oneelecener: -4431.08330956 hartree
twoeener: 1930.56090764 hartree
cpcmener: -0.01980799 hartree
kineticenergy: 848.04896204 hartree
xcener: -85.350894461857 hartree
chargesum: -0.0000000
charge: -0.415720 -0.376611 0.357027 0.386515 0.058002 -0.313170 -0.250981 -0.218630 0.024415 -0.323336 -0.317038 -0.298806 0.036890 0.018477 -0.073305 -0.208621 -0.135430 -0.244730 -0.171006 -0.171345 0.087029 0.091060 0.101231 0.087852 0.102302 0.086599 0.085001 0.035861 0.092144 0.094423 0.100202 0.087169 0.096617 0.095827 0.095926 0.093537 0.078587 0.117267 0.099050 0.160460 0.135541 0.091790 0.102345 0.110689 0.153797 0.155096
qa: -0.4157 -0.3766 0.3570 0.3865 0.0580 -0.3132 -0.2510 -0.2186 0.0244 -0.3233 -0.3170 -0.2988 0.0369 0.0185 -0.0733 -0.2086 -0.1354 -0.2447 -0.1710 -0.1713 0.0870 0.0911 0.1012 0.0879 0.1023 0.0866 0.0850 0.0359 0.0921 0.0944 0.1002 0.0872 0.0966 0.0958 0.0959 0.0935 0.0786 0.1173 0.0991 0.1605 0.1355 0.0918 0.1023 0.1107 0.1538 0.1551
va: 2.0470 1.9443 3.7201 3.6756 3.9682 4.0555 4.0076 3.9746 3.7369 3.8969 3.9525 3.9347 3.8926 3.4914 3.7921 3.9340 3.8723 3.9126 3.9226 3.9112 1.0022 1.0267 1.0080 1.0121 1.0066 1.0136 1.0124 1.0242 1.0014 1.0178 1.0092 0.9982 1.0041 1.0023 1.0031 1.0176 1.0037 0.9888 0.9857 0.9977 1.0018 1.0067 0.9936 0.9919 0.9936 0.9908
dispcorr: -0.023230725 hartree
energy: -852.145664729401
dipole: 10.93392 -11.74024 -0.80632 11.43943 -10.18310 1.25633 -2.19664 2.45406 0.25742
magnitude: 1.51486 au
magnitude: 3.85047 debye
