program: Orca
programVersion: 5.0.2
elementType: O O C C C C C C C C C C C C C C C C C C H H H H H H H H H H H H H H H H H H H H H H H H H H
charge: 0
multiplicity: 1
keywords: wb97x-d3
keywords: def2-TZVPP
keywords: def2/J RIJCOSX
keywords: DEFGRID2
keywords: scfconv7
keywords: smallprint printgap noloewdin
keywords: NOSOSCF
formula: C18H26O2
InChI: InChI=1/C18H26O2/c1-13(2)18-10-9-17(4,20-18)16(11-18)19-12-15-8-6-5-7-14(15)3/h5-8,13,16H,9-12H2,1-4H3
46 atoms
O  2.691372 -0.367268 -0.271113
O  -0.182195 -0.958552 -0.921393
C  2.479304 1.034954 -0.114574
C  1.683041 -0.836258 0.619971
C  0.4101 -0.156138 0.077297
C  0.986149 1.167422 -0.470682
C  2.615722 1.216992 1.410313
C  2.046102 -0.113659 1.930444
C  3.471971 1.837736 -0.943445
C  1.662008 -2.340492 0.702911
C  3.477289 1.462102 -2.421501
C  3.229749 3.333526 -0.767199
C  -1.46569 -0.52703 -1.302902
C  -2.528852 -0.81085 -0.264741
C  -3.650245 0.019575 -0.1373
C  -2.409925 -1.92952 0.556088
C  -4.610549 -0.292542 0.82335
C  -3.836514 1.227021 -1.010877
C  -3.373209 -2.226908 1.508617
C  -4.478968 -1.401629 1.645975
H  -0.305325 0.01345 0.889756
H  0.845137 1.218094 -1.553188
H  0.522686 2.052236 -0.035012
H  2.072433 2.088346 1.775361
H  3.66396 1.342029 1.690745
H  2.797758 -0.683912 2.479042
H  1.185516 0.007211 2.589389
H  4.466836 1.612348 -0.540132
H  1.515057 -2.809863 -0.269372
H  2.596569 -2.715679 1.122547
H  0.854602 -2.668199 1.359206
H  4.247385 2.027938 -2.949014
H  3.689327 0.404422 -2.578915
H  2.525579 1.68861 -2.906538
H  3.99375 3.909864 -1.291477
H  3.260968 3.63634 0.280577
H  2.261371 3.635222 -1.172247
H  -1.707449 -1.059861 -2.22792
H  -1.456284 0.538699 -1.55951
H  -1.549078 -2.578947 0.454452
H  -5.476705 0.350359 0.929852
H  -3.852478 0.966628 -2.071063
H  -4.776234 1.730407 -0.785989
H  -3.035544 1.957275 -0.875042
H  -3.258836 -3.099678 2.139048
H  -5.237091 -1.61896 2.387807
elementType: O C H
totalener: -852.12220832 hartree
nucrepener: 1654.98242761 hartree
electener: -2507.10463593 hartree
oneelecener: -4444.27789258 hartree
twoeener: 1937.17325665 hartree
cpcmener: -0.01966010 hartree
kineticenergy: 848.04650862 hartree
xcener: -85.350198425630 hartree
chargesum: -0.0000000
charge: -0.416434 -0.375784 0.372763 0.379384 0.072575 -0.367137 -0.212040 -0.228734 0.025201 -0.321128 -0.299371 -0.314858 0.044434 0.007985 -0.059770 -0.209138 -0.141462 -0.244169 -0.170746 -0.167711 0.085688 0.102990 0.102427 0.084964 0.091079 0.087034 0.084692 0.035810 0.094436 0.098982 0.092739 0.095102 0.094064 0.079038 0.096980 0.097077 0.085731 0.115691 0.097769 0.153714 0.135194 0.111267 0.092597 0.100980 0.154727 0.155367
qa: -0.4164 -0.3758 0.3728 0.3794 0.0726 -0.3671 -0.2120 -0.2287 0.0252 -0.3211 -0.2994 -0.3149 0.0444 0.0080 -0.0598 -0.2091 -0.1415 -0.2442 -0.1707 -0.1677 0.0857 0.1030 0.1024 0.0850 0.0911 0.0870 0.0847 0.0358 0.0944 0.0990 0.0927 0.0951 0.0941 0.0790 0.0970 0.0971 0.0857 0.1157 0.0978 0.1537 0.1352 0.1113 0.0926 0.1010 0.1547 0.1554
va: 2.0510 1.9473 3.7062 3.6794 3.9578 4.1103 3.9704 3.9860 3.7371 3.8989 3.9409 3.9507 3.8853 3.4981 3.7744 3.9465 3.8804 3.9136 3.9225 3.9116 1.0020 1.0151 1.0100 1.0121 1.0139 1.0129 1.0123 1.0234 1.0172 1.0091 1.0015 1.0033 1.0164 1.0023 1.0043 1.0010 0.9989 0.9886 0.9875 1.0023 1.0021 0.9919 1.0066 0.9932 0.9931 0.9907
dispcorr: -0.023403017 hartree
energy: -852.145611336720
dipole: 9.40508 -10.13649 -0.73140 11.29250 -10.08848 1.20401 -2.59422 3.16467 0.57045
magnitude: 1.51987 au
magnitude: 3.86321 debye
