program: Orca
programVersion: 5.0.2
elementType: O O C C C C C C C C C C C C C C C C C C H H H H H H H H H H H H H H H H H H H H H H H H H H
charge: 0
multiplicity: 1
keywords: wb97x-d3
keywords: def2-TZVPP
keywords: def2/J RIJCOSX
keywords: DEFGRID2
keywords: scfconv7
keywords: smallprint printgap noloewdin
keywords: NOSOSCF
formula: C18H26O2
InChI: InChI=1/C18H26O2/c1-13(2)18-10-9-17(4,20-18)16(11-18)19-12-15-8-6-5-7-14(15)3/h5-8,13,16H,9-12H2,1-4H3
46 atoms
O  2.698837 -0.36735 -0.303195
O  -0.185944 -0.922979 -0.906035
C  2.500657 1.030921 -0.100748
C  1.7101 -0.85596 0.599002
C  0.428452 -0.153916 0.105956
C  0.999384 1.184026 -0.411834
C  2.678748 1.167141 1.424447
C  2.108543 -0.172562 1.920346
C  3.476548 1.850535 -0.933178
C  1.683933 -2.361999 0.640016
C  3.428994 1.527681 -2.422963
C  3.260697 3.3422 -0.697946
C  -1.465642 -0.467249 -1.267623
C  -2.536445 -0.784788 -0.247522
C  -3.702554 -0.009898 -0.178443
C  -2.388252 -1.873839 0.60684
C  -4.675774 -0.344009 0.760556
C  -3.919646 1.16016 -1.094479
C  -3.365691 -2.193616 1.538115
C  -4.514793 -1.422434 1.61858
H  -0.269486 -0.00734 0.937868
H  0.829158 1.274061 -1.487502
H  0.554331 2.055749 0.067195
H  2.154365 2.03267 1.828768
H  3.735185 1.273461 1.680993
H  2.86648 -0.764364 2.436448
H  1.263668 -0.062456 2.601151
H  4.48063 1.599336 -0.569943
H  1.504172 -2.802853 -0.340012
H  2.629308 -2.752932 1.019064
H  0.895912 -2.705036 1.311895
H  3.613209 0.472225 -2.624298
H  2.467892 1.791217 -2.869098
H  4.19455 2.096248 -2.95409
H  3.3378 3.60989 0.357013
H  2.281066 3.669573 -1.053122
H  4.010833 3.926539 -1.233314
H  -1.710138 -0.956577 -2.215895
H  -1.449838 0.609193 -1.477075
H  -1.493921 -2.481923 0.550154
H  -5.576395 0.256067 0.821475
H  -3.885586 0.868329 -2.146134
H  -4.890757 1.620852 -0.916559
H  -3.161355 1.934236 -0.955923
H  -3.227737 -3.042147 2.196341
H  -5.284254 -1.657957 2.342982
elementType: O C H
totalener: -852.12249396 hartree
nucrepener: 1652.71595181 hartree
electener: -2504.83844577 hartree
oneelecener: -4439.72674476 hartree
twoeener: 1934.88829899 hartree
cpcmener: -0.01978143 hartree
kineticenergy: 848.04365414 hartree
xcener: -85.350004373591 hartree
chargesum: -0.0000000
charge: -0.415872 -0.377113 0.371299 0.378325 0.070998 -0.363449 -0.212794 -0.227446 0.025472 -0.322487 -0.298982 -0.315000 0.038294 0.018592 -0.071664 -0.210732 -0.138301 -0.245388 -0.171932 -0.168995 0.087443 0.103470 0.102423 0.084799 0.090748 0.087050 0.084919 0.034918 0.095285 0.099318 0.092563 0.094038 0.078770 0.095219 0.096803 0.085849 0.096898 0.117565 0.099059 0.159195 0.135287 0.110759 0.092465 0.102810 0.154451 0.155070
qa: -0.4159 -0.3771 0.3713 0.3783 0.0710 -0.3634 -0.2128 -0.2274 0.0255 -0.3225 -0.2990 -0.3150 0.0383 0.0186 -0.0717 -0.2107 -0.1383 -0.2454 -0.1719 -0.1690 0.0874 0.1035 0.1024 0.0848 0.0907 0.0871 0.0849 0.0349 0.0953 0.0993 0.0926 0.0940 0.0788 0.0952 0.0968 0.0858 0.0969 0.1176 0.0991 0.1592 0.1353 0.1108 0.0925 0.1028 0.1545 0.1551
va: 2.0509 1.9474 3.7076 3.6840 3.9518 4.1123 3.9718 3.9858 3.7383 3.8993 3.9400 3.9507 3.8895 3.4931 3.7939 3.9371 3.8765 3.9136 3.9240 3.9119 1.0018 1.0141 1.0104 1.0120 1.0141 1.0129 1.0121 1.0239 1.0173 1.0092 1.0015 1.0166 1.0023 1.0034 1.0011 0.9990 1.0042 0.9887 0.9859 0.9987 1.0020 0.9919 1.0067 0.9932 0.9933 0.9909
dispcorr: -0.023296218 hartree
energy: -852.145790175646
dipole: 9.42145 -10.11415 -0.69270 11.21235 -10.01900 1.19335 -2.56715 3.16152 0.59436
magnitude: 1.50239 au
magnitude: 3.81878 debye
