program: Orca
programVersion: 5.0.2
elementType: O O C C C C C C C C C C C C C C C C C C H H H H H H H H H H H H H H H H H H H H H H H H H H
charge: 0
multiplicity: 1
keywords: wb97x-d3
keywords: def2-TZVPP
keywords: def2/J RIJCOSX
keywords: DEFGRID2
keywords: scfconv7
keywords: smallprint printgap noloewdin
keywords: NOSOSCF
formula: C18H26O2
InChI: InChI=1/C18H26O2/c1-13(2)18-10-9-17(4,20-18)16(11-18)19-12-15-8-6-5-7-14(15)3/h5-8,13,16H,9-12H2,1-4H3
46 atoms
O  2.091728 0.143563 -1.01367
O  0.045873 -1.761446 -0.146753
C  2.047086 0.951072 0.163256
C  2.339956 -1.11733 -0.397581
C  1.145563 -1.238928 0.565758
C  0.980194 0.229744 1.013711
C  3.417306 0.655013 0.799236
C  3.591331 -0.834251 0.456702
C  1.795527 2.4129 -0.17851
C  2.501006 -2.214631 -1.418283
C  0.542557 2.636877 -1.019303
C  1.743559 3.256947 1.091282
C  -1.169474 -1.822619 0.556555
C  -2.201316 -0.854002 0.031868
C  -3.41375 -0.702664 0.720527
C  -1.981062 -0.132972 -1.135904
C  -4.364037 0.181952 0.220322
C  -3.683738 -1.47419 1.978748
C  -2.938606 0.748128 -1.621411
C  -4.134761 0.907681 -0.941375
H  1.379539 -1.900956 1.408588
H  -0.023571 0.599755 0.798539
H  1.148318 0.357822 2.083072
H  3.436333 0.855538 1.870045
H  4.194233 1.267144 0.335339
H  4.496249 -1.009788 -0.127289
H  3.644957 -1.479432 1.334827
H  2.657378 2.749757 -0.767287
H  2.626579 -3.17667 -0.920167
H  1.642491 -2.291191 -2.084264
H  3.388808 -2.042779 -2.028613
H  0.442637 3.695336 -1.266105
H  0.571381 2.089044 -1.961177
H  -0.364892 2.346183 -0.487485
H  1.645935 4.314958 0.842429
H  2.644853 3.150316 1.696811
H  0.88814 2.990859 1.716299
H  -1.015849 -1.660279 1.630662
H  -1.560987 -2.843854 0.464413
H  -1.045719 -0.246416 -1.667719
H  -5.300447 0.306281 0.752172
H  -2.979512 -1.214428 2.773135
H  -4.686575 -1.275366 2.355126
H  -3.599184 -2.552137 1.82322
H  -2.745482 1.3063 -2.528952
H  -4.888109 1.593038 -1.308962
elementType: O C H
totalener: -852.12085183 hartree
nucrepener: 1687.76766657 hartree
electener: -2539.88851840 hartree
oneelecener: -4510.21043683 hartree
twoeener: 1970.32191843 hartree
cpcmener: -0.01941884 hartree
kineticenergy: 848.04893070 hartree
xcener: -85.352908802020 hartree
chargesum: 0.0000000
charge: -0.419581 -0.386578 0.362983 0.311297 0.088664 -0.343539 -0.229381 -0.186544 0.046641 -0.305514 -0.322222 -0.317282 0.019084 0.078539 -0.105003 -0.226871 -0.122105 -0.246177 -0.161693 -0.173575 0.092964 0.120371 0.101360 0.083702 0.090088 0.085754 0.085270 0.035590 0.097363 0.093161 0.094134 0.102527 0.096967 0.077817 0.096881 0.096745 0.087818 0.105331 0.114031 0.133118 0.136494 0.105588 0.091876 0.105152 0.154182 0.154573
qa: -0.4196 -0.3866 0.3630 0.3113 0.0887 -0.3435 -0.2294 -0.1865 0.0466 -0.3055 -0.3222 -0.3173 0.0191 0.0785 -0.1050 -0.2269 -0.1221 -0.2462 -0.1617 -0.1736 0.0930 0.1204 0.1014 0.0837 0.0901 0.0858 0.0853 0.0356 0.0974 0.0932 0.0941 0.1025 0.0970 0.0778 0.0969 0.0967 0.0878 0.1053 0.1140 0.1331 0.1365 0.1056 0.0919 0.1052 0.1542 0.1546
va: 2.0277 1.9537 3.6898 3.7451 3.9112 3.9885 3.9896 3.9512 3.7255 3.9203 3.9535 3.9520 3.9389 3.4030 3.8252 3.8843 3.8582 3.9124 3.8912 3.9138 1.0132 0.9994 1.0183 1.0131 1.0146 1.0146 1.0171 1.0241 1.0013 1.0123 1.0076 1.0067 1.0109 0.9967 1.0046 1.0015 0.9982 0.9877 0.9922 1.0354 1.0006 0.9945 1.0065 0.9945 0.9928 0.9904
dispcorr: -0.024892248 hartree
energy: -852.145744073417
dipole: 6.62920 -6.41053 0.21867 5.61205 -5.73753 -0.12547 6.40431 -4.69071 1.71360
magnitude: 1.73204 au
magnitude: 4.40250 debye
