program: Orca
programVersion: 5.0.2
elementType: O O C C C C C C C C C C C C C C C C C C H H H H H H H H H H H H H H H H H H H H H H H H H H
charge: 0
multiplicity: 1
keywords: wb97x-d3
keywords: def2-TZVPP
keywords: def2/J RIJCOSX
keywords: DEFGRID2
keywords: scfconv7
keywords: smallprint printgap noloewdin
keywords: NOSOSCF
formula: C18H26O2
InChI: InChI=1/C18H26O2/c1-13(2)18-10-9-17(4,20-18)16(11-18)19-12-15-8-6-5-7-14(15)3/h5-8,13,16H,9-12H2,1-4H3
46 atoms
O  2.14438 0.040022 -1.027531
O  -0.010041 -1.836019 -0.385359
C  1.865814 0.947734 0.039774
C  2.285016 -1.152439 -0.258763
C  0.928083 -1.225344 0.468683
C  0.66768 0.274108 0.736211
C  3.096695 0.758153 0.941005
C  3.34793 -0.752309 0.784188
C  1.643999 2.35931 -0.484131
C  2.65581 -2.330826 -1.121423
C  0.564622 2.440025 -1.559059
C  1.325568 3.311732 0.664561
C  -1.230978 -2.217047 0.20687
C  -2.204589 -1.082559 0.405721
C  -2.674708 -0.334061 -0.684743
C  -2.629753 -0.762839 1.68997
C  -3.543239 0.725346 -0.438364
C  -2.244006 -0.626038 -2.092509
C  -3.502494 0.292176 1.920994
C  -3.955088 1.04429 0.849151
H  1.007189 -1.803523 1.398355
H  -0.273083 0.59023 0.288862
H  0.615061 0.507145 1.800104
H  2.914513 1.059388 1.972385
H  3.93951 1.345573 0.569277
H  4.348708 -0.95516 0.398988
H  3.2429 -1.309732 1.716219
H  2.590346 2.682642 -0.934547
H  3.628021 -2.170359 -1.589748
H  2.730757 -3.233867 -0.514339
H  1.928234 -2.516852 -1.910249
H  0.776998 1.793474 -2.410168
H  -0.420728 2.173702 -1.170336
H  0.490983 3.459833 -1.940148
H  0.382956 3.052738 1.152004
H  1.228447 4.334922 0.297786
H  2.10548 3.31562 1.427608
H  -1.053346 -2.716898 1.168418
H  -1.665004 -2.967674 -0.460341
H  -2.262822 -1.345141 2.527805
H  -3.908893 1.311547 -1.27369
H  -2.869146 -0.092955 -2.807721
H  -1.211681 -0.322254 -2.270288
H  -2.306413 -1.689177 -2.331008
H  -3.818557 0.525734 2.92971
H  -4.631051 1.874948 1.008565
elementType: O C H
totalener: -852.12096982 hartree
nucrepener: 1711.87493219 hartree
electener: -2563.99590201 hartree
oneelecener: -4558.50948677 hartree
twoeener: 1994.51358476 hartree
cpcmener: -0.01893869 hartree
kineticenergy: 848.06204693 hartree
xcener: -85.352579061383 hartree
chargesum: -0.0000000
charge: -0.417200 -0.368023 0.349417 0.327452 0.066377 -0.289785 -0.232124 -0.194019 0.049048 -0.303764 -0.305658 -0.315860 0.026661 -0.004329 -0.087133 -0.149097 -0.142097 -0.236090 -0.167202 -0.159107 0.078389 0.077596 0.101093 0.083762 0.088707 0.087382 0.084559 0.034842 0.094252 0.096131 0.089510 0.095860 0.068437 0.100644 0.087184 0.096633 0.097048 0.097841 0.118983 0.135841 0.136920 0.094859 0.088924 0.105791 0.155323 0.156021
qa: -0.4172 -0.3680 0.3494 0.3275 0.0664 -0.2898 -0.2321 -0.1940 0.0490 -0.3038 -0.3057 -0.3159 0.0267 -0.0043 -0.0871 -0.1491 -0.1421 -0.2361 -0.1672 -0.1591 0.0784 0.0776 0.1011 0.0838 0.0887 0.0874 0.0846 0.0348 0.0943 0.0961 0.0895 0.0959 0.0684 0.1006 0.0872 0.0966 0.0970 0.0978 0.1190 0.1358 0.1369 0.0949 0.0889 0.1058 0.1553 0.1560
va: 2.0413 1.9389 3.7769 3.7272 4.0087 4.0391 3.9902 3.9506 3.7079 3.9169 3.9452 3.9527 3.8866 3.4835 3.7198 3.8669 3.8555 3.9214 3.9039 3.9046 1.0164 1.0246 1.0149 1.0126 1.0161 1.0130 1.0155 1.0236 1.0081 1.0011 1.0179 1.0140 0.9985 1.0076 0.9987 1.0042 1.0015 1.0015 0.9876 1.0032 1.0007 1.0051 1.0113 1.0004 0.9913 0.9900
dispcorr: -0.025930038 hartree
energy: -852.146899853844
dipole: 7.21611 -7.24886 -0.03275 6.60393 -6.61340 -0.00947 -1.03142 2.29681 1.26539
magnitude: 1.26585 au
magnitude: 3.21754 debye
