program: Orca
programVersion: 5.0.2
elementType: O O C C C C C C C C C C C C C C C C C C H H H H H H H H H H H H H H H H H H H H H H H H H H
charge: 0
multiplicity: 1
keywords: wb97x-d3
keywords: def2-TZVPP
keywords: def2/J RIJCOSX
keywords: DEFGRID2
keywords: scfconv7
keywords: smallprint printgap noloewdin
keywords: NOSOSCF
formula: C18H26O2
InChI: InChI=1/C18H26O2/c1-13(2)18-10-9-17(4,20-18)16(11-18)19-12-15-8-6-5-7-14(15)3/h5-8,13,16H,9-12H2,1-4H3
46 atoms
O  2.250261 0.0171 -0.987423
O  -0.021139 -1.771724 -0.506988
C  1.894438 0.965114 0.020234
C  2.27808 -1.153856 -0.174806
C  0.855027 -1.166644 0.415868
C  0.61294 0.346123 0.612367
C  3.023401 0.769386 1.045561
C  3.243737 -0.751281 0.957943
C  1.769518 2.366622 -0.560588
C  2.692343 -2.371888 -0.958857
C  0.816108 2.444299 -1.749007
C  1.35349 3.357045 0.522976
C  -1.248087 -2.218172 0.025237
C  -2.224724 -1.116365 0.349651
C  -2.74342 -0.285891 -0.655989
C  -2.605231 -0.910666 1.670865
C  -3.621651 0.730746 -0.292231
C  -2.353825 -0.45075 -2.095852
C  -3.486491 0.10394 2.020145
C  -3.991442 0.932441 1.031423
H  0.828435 -1.71812 1.364379
H  -0.270951 0.668423 0.062934
H  0.460903 0.61647 1.657628
H  2.749208 1.107862 2.044463
H  3.91639 1.321513 0.743304
H  4.271617 -0.9932 0.682727
H  3.027902 -1.276053 1.889758
H  2.767289 2.654392 -0.913524
H  2.675197 -3.253715 -0.31658
H  2.038587 -2.564329 -1.808597
H  3.711004 -2.259483 -1.333626
H  1.102507 1.768775 -2.555232
H  -0.212837 2.212608 -1.464525
H  0.812781 3.455257 -2.160948
H  0.356701 3.133651 0.909527
H  1.324338 4.372182 0.123449
H  2.044786 3.362717 1.36729
H  -1.076221 -2.823678 0.925109
H  -1.673216 -2.888512 -0.727133
H  -2.201065 -1.556297 2.442517
H  -4.024562 1.379533 -1.061468
H  -1.333141 -0.111295 -2.280135
H  -2.404328 -1.491249 -2.420186
H  -3.010809 0.126433 -2.74514
H  -3.770496 0.24601 3.055077
H  -4.676275 1.732141 1.283943
elementType: O C H
totalener: -852.12157440 hartree
nucrepener: 1706.32698135 hartree
electener: -2558.44855575 hartree
oneelecener: -4547.36679281 hartree
twoeener: 1988.91823707 hartree
cpcmener: -0.01934453 hartree
kineticenergy: 848.05820354 hartree
xcener: -85.351420489180 hartree
chargesum: 0.0000000
charge: -0.417175 -0.372339 0.359845 0.328057 0.067148 -0.291984 -0.233117 -0.195371 0.047144 -0.302654 -0.307378 -0.314577 0.025266 -0.032736 -0.063700 -0.128870 -0.144828 -0.238304 -0.182666 -0.153645 0.078368 0.070523 0.102155 0.084193 0.088722 0.087618 0.084292 0.035195 0.095751 0.088428 0.094620 0.095252 0.071814 0.099873 0.086803 0.096456 0.096771 0.099443 0.119630 0.135532 0.136860 0.090584 0.106270 0.095311 0.155200 0.156217
qa: -0.4172 -0.3723 0.3598 0.3281 0.0671 -0.2920 -0.2331 -0.1954 0.0471 -0.3027 -0.3074 -0.3146 0.0253 -0.0327 -0.0637 -0.1289 -0.1448 -0.2383 -0.1827 -0.1536 0.0784 0.0705 0.1022 0.0842 0.0887 0.0876 0.0843 0.0352 0.0958 0.0884 0.0946 0.0953 0.0718 0.0999 0.0868 0.0965 0.0968 0.0994 0.1196 0.1355 0.1369 0.0906 0.1063 0.0953 0.1552 0.1562
va: 2.0460 1.9321 3.7663 3.7390 4.0157 4.0289 3.9891 3.9485 3.7061 3.9128 3.9459 3.9524 3.8807 3.4955 3.7190 3.8490 3.8774 3.9245 3.9186 3.8983 1.0146 1.0297 1.0139 1.0126 1.0162 1.0125 1.0153 1.0233 1.0010 1.0199 1.0081 1.0156 0.9968 1.0068 0.9987 1.0042 1.0016 1.0018 0.9897 1.0027 1.0007 1.0066 1.0004 1.0047 0.9918 0.9900
dispcorr: -0.025580712 hartree
energy: -852.147155109306
dipole: 7.15964 -7.32915 -0.16951 6.90023 -6.88882 0.01141 -1.27769 2.54272 1.26503
magnitude: 1.27638 au
magnitude: 3.24431 debye
