program: Orca
programVersion: 5.0.2
elementType: O O C C C C C C C C C C C C C C C C C C H H H H H H H H H H H H H H H H H H H H H H H H H H
charge: 0
multiplicity: 1
keywords: wb97x-d3
keywords: def2-TZVPP
keywords: def2/J RIJCOSX
keywords: DEFGRID2
keywords: scfconv7
keywords: smallprint printgap noloewdin
keywords: NOSOSCF
formula: C18H26O2
InChI: InChI=1/C18H26O2/c1-13(2)18-10-9-17(4,20-18)16(11-18)19-12-15-8-6-5-7-14(15)3/h5-8,13,16H,9-12H2,1-4H3
46 atoms
O  2.465055 0.029926 -0.721215
O  -0.424727 -0.377077 -1.207752
C  2.295006 1.207279 0.0688
C  1.603089 -0.840386 0.007621
C  0.266676 -0.075202 -0.017522
C  0.763729 1.384861 0.043249
C  2.680058 0.717967 1.475789
C  2.161384 -0.730996 1.438523
C  3.089071 2.3698 -0.508157
C  1.599255 -2.233324 -0.566081
C  2.92133 3.615875 0.354831
C  4.567758 2.049738 -0.702024
C  -1.713473 0.191695 -1.303349
C  -2.692518 -0.373343 -0.307431
C  -3.140661 -1.699947 -0.40201
C  -3.142395 0.428657 0.735699
C  -4.028893 -2.172074 0.560142
C  -2.699602 -2.603663 -1.516507
C  -4.028734 -0.053769 1.689019
C  -4.470341 -1.363633 1.599706
H  -0.345345 -0.340911 0.851932
H  0.46249 1.933031 -0.854003
H  0.382491 1.932103 0.905514
H  2.220388 1.319041 2.260283
H  3.759403 0.748753 1.631719
H  2.972492 -1.447869 1.57812
H  1.406911 -0.945707 2.196287
H  2.661899 2.585806 -1.494846
H  2.594542 -2.676891 -0.498157
H  0.91886 -2.871437 0.000068
H  1.291827 -2.255961 -1.611134
H  3.434672 4.466368 -0.096768
H  1.874206 3.898535 0.476048
H  3.345242 3.474038 1.351478
H  5.077417 1.876504 0.248226
H  5.072801 2.887614 -1.187188
H  4.724167 1.171815 -1.329503
H  -2.04916 -0.003424 -2.324968
H  -1.673873 1.283035 -1.191692
H  -2.788026 1.451048 0.802534
H  -4.385668 -3.193385 0.493114
H  -2.925602 -2.175428 -2.495954
H  -1.625266 -2.789673 -1.494546
H  -3.201415 -3.569061 -1.457706
H  -4.365166 0.586894 2.494185
H  -5.160365 -1.759341 2.334215
elementType: O C H
totalener: -852.12323423 hartree
nucrepener: 1658.75082905 hartree
electener: -2510.87406328 hartree
oneelecener: -4451.96707522 hartree
twoeener: 1941.09301193 hartree
cpcmener: -0.01949913 hartree
kineticenergy: 848.05798417 hartree
xcener: -85.350579548516 hartree
chargesum: 0.0000000
charge: -0.414346 -0.367184 0.345639 0.380520 0.029267 -0.280155 -0.253948 -0.210661 0.028041 -0.322743 -0.317361 -0.298374 0.057067 -0.042948 -0.088644 -0.124244 -0.140841 -0.238754 -0.182876 -0.153571 0.080602 0.092884 0.097159 0.087439 0.099523 0.086060 0.084020 0.035583 0.099001 0.097394 0.090532 0.096498 0.096853 0.086273 0.078716 0.095175 0.092680 0.120843 0.095623 0.138269 0.137219 0.103805 0.101309 0.091045 0.155462 0.156148
qa: -0.4143 -0.3672 0.3456 0.3805 0.0293 -0.2802 -0.2539 -0.2107 0.0280 -0.3227 -0.3174 -0.2984 0.0571 -0.0429 -0.0886 -0.1242 -0.1408 -0.2388 -0.1829 -0.1536 0.0806 0.0929 0.0972 0.0874 0.0995 0.0861 0.0840 0.0356 0.0990 0.0974 0.0905 0.0965 0.0969 0.0863 0.0787 0.0952 0.0927 0.1208 0.0956 0.1383 0.1372 0.1038 0.1013 0.0910 0.1555 0.1561
va: 2.0462 1.9523 3.7390 3.6941 4.0621 3.9908 4.0176 3.9634 3.7293 3.8992 3.9529 3.9369 3.8167 3.5026 3.7990 3.8390 3.8767 3.9170 3.9261 3.9019 1.0058 1.0245 1.0103 1.0119 1.0075 1.0139 1.0148 1.0231 1.0095 0.9996 1.0172 1.0043 1.0015 0.9981 1.0039 1.0029 1.0178 0.9924 0.9989 1.0021 1.0007 0.9964 0.9987 1.0066 0.9922 0.9900
dispcorr: -0.023732934 hartree
energy: -852.146967164881
dipole: 12.97492 -13.59368 -0.61876 5.42119 -4.98886 0.43233 1.23177 -0.21928 1.01248
magnitude: 1.26289 au
magnitude: 3.21002 debye
