program: Orca
programVersion: 5.0.2
elementType: O O C C C C C C C C C C C C C C C C C C H H H H H H H H H H H H H H H H H H H H H H H H H H
charge: 0
multiplicity: 1
keywords: wb97x-d3
keywords: def2-TZVPP
keywords: def2/J RIJCOSX
keywords: DEFGRID2
keywords: scfconv7
keywords: smallprint printgap noloewdin
keywords: NOSOSCF
formula: C18H26O2
InChI: InChI=1/C18H26O2/c1-13(2)18-10-9-17(4,20-18)16(11-18)19-12-15-8-6-5-7-14(15)3/h5-8,13,16H,9-12H2,1-4H3
46 atoms
O  2.092692 0.810051 -0.992358
O  -0.43297 -0.43318 0.078802
C  2.703229 0.931031 0.292223
C  1.759102 -0.57512 -0.941966
C  0.925749 -0.680159 0.350997
C  1.583294 0.414288 1.218565
C  3.786568 -0.168302 0.255192
C  3.119298 -1.227663 -0.638646
C  3.212631 2.348551 0.544606
C  1.096532 -1.036866 -2.213396
C  4.159955 2.835107 -0.552797
C  2.094847 3.372657 0.730313
C  -1.288759 -0.759153 1.153822
C  -2.714654 -0.666047 0.691894
C  -3.260278 -1.632432 -0.16718
C  -3.503765 0.396889 1.116932
C  -4.584127 -1.489928 -0.573414
C  -2.461688 -2.815299 -0.630426
C  -4.825077 0.52338 0.709634
C  -5.364744 -0.424821 -0.144101
H  1.029291 -1.679184 0.794286
H  0.851425 1.195196 1.431958
H  1.963869 0.048222 2.172401
H  4.022052 -0.531244 1.256075
H  4.717489 0.189102 -0.184376
H  3.677585 -1.377317 -1.56464
H  3.015633 -2.203137 -0.162236
H  3.780962 2.297096 1.480743
H  1.779588 -0.939083 -3.059035
H  0.82381 -2.090305 -2.134525
H  0.193243 -0.471905 -2.441853
H  3.634467 2.995245 -1.495888
H  4.604434 3.789336 -0.265139
H  4.983649 2.147295 -0.744177
H  1.498268 3.18874 1.623795
H  1.418557 3.390701 -0.126683
H  2.516519 4.374236 0.83359
H  -1.131544 -0.082828 2.003956
H  -1.070152 -1.773362 1.517256
H  -3.076666 1.138249 1.782593
H  -5.014783 -2.231023 -1.236685
H  -2.134547 -3.432157 0.209721
H  -3.05098 -3.450676 -1.290531
H  -1.564412 -2.518388 -1.17318
H  -5.423867 1.355845 1.056342
H  -6.392402 -0.341903 -0.474916
elementType: O C H
totalener: -852.12141843 hartree
nucrepener: 1636.93394574 hartree
electener: -2489.05536417 hartree
oneelecener: -4408.59702394 hartree
twoeener: 1919.54165977 hartree
cpcmener: -0.02156267 hartree
kineticenergy: 848.04297153 hartree
xcener: -85.345967451072 hartree
chargesum: 0.0000000
charge: -0.425627 -0.361013 0.315951 0.348675 0.062803 -0.281314 -0.225734 -0.209989 0.064298 -0.330463 -0.304955 -0.314126 0.019465 -0.046464 -0.059479 -0.118930 -0.144459 -0.223092 -0.190468 -0.150048 0.072342 0.102363 0.093914 0.084812 0.097225 0.084238 0.083293 0.041095 0.101692 0.095220 0.094449 0.083142 0.094190 0.091889 0.087392 0.091399 0.093561 0.091821 0.109618 0.138643 0.137339 0.100661 0.094714 0.098958 0.154851 0.156150
qa: -0.4256 -0.3610 0.3160 0.3487 0.0628 -0.2813 -0.2257 -0.2100 0.0643 -0.3305 -0.3050 -0.3141 0.0195 -0.0465 -0.0595 -0.1189 -0.1445 -0.2231 -0.1905 -0.1500 0.0723 0.1024 0.0939 0.0848 0.0972 0.0842 0.0833 0.0411 0.1017 0.0952 0.0944 0.0831 0.0942 0.0919 0.0874 0.0914 0.0936 0.0918 0.1096 0.1386 0.1373 0.1007 0.0947 0.0990 0.1549 0.1562
va: 2.0415 1.9449 3.7450 3.7205 4.0331 3.9751 3.9948 3.9543 3.6806 3.9096 3.9504 3.9439 3.8816 3.6622 3.7558 3.8825 3.8779 3.8968 3.9253 3.9002 1.0168 1.0194 1.0173 1.0168 1.0112 1.0144 1.0145 1.0172 1.0097 1.0000 1.0154 1.0085 1.0032 1.0073 1.0032 1.0113 1.0041 0.9943 0.9876 1.0023 1.0017 0.9992 1.0078 0.9984 0.9927 0.9904
dispcorr: -0.022719654 hartree
energy: -852.144138087658
dipole: 14.74856 -14.17909 0.56947 2.70208 -3.67274 -0.97065 -0.16005 1.32128 1.16123
magnitude: 1.61707 au
magnitude: 4.11026 debye
