program: Orca
programVersion: 5.0.2
elementType: O O C C C C C C C C C C C C C C C C C C H H H H H H H H H H H H H H H H H H H H H H H H H H
charge: 0
multiplicity: 1
keywords: wb97x-d3
keywords: def2-TZVPP
keywords: def2/J RIJCOSX
keywords: DEFGRID2
keywords: scfconv7
keywords: smallprint printgap noloewdin
keywords: NOSOSCF
formula: C18H26O2
InChI: InChI=1/C18H26O2/c1-13(2)18-10-9-17(4,20-18)16(11-18)19-12-15-8-6-5-7-14(15)3/h5-8,13,16H,9-12H2,1-4H3
46 atoms
O  1.940976 0.53391 -1.01875
O  -0.236338 -1.209462 -0.144388
C  2.216838 1.055078 0.281905
C  2.0767 -0.853451 -0.725078
C  1.050754 -1.043786 0.404844
C  1.196986 0.2962 1.156964
C  3.603275 0.46009 0.58134
C  3.4786 -0.922471 -0.085305
C  2.076395 2.570277 0.300321
C  1.894229 -1.711188 -1.950091
C  2.326195 3.119575 1.701147
C  2.972158 3.269035 -0.717698
C  -1.219266 -1.590096 0.80436
C  -2.524008 -0.921095 0.474316
C  -3.292345 -1.320782 -0.628354
C  -2.95995 0.135862 1.266822
C  -4.468344 -0.628902 -0.906219
C  -2.882181 -2.478184 -1.491969
C  -4.138736 0.811667 0.984446
C  -4.892696 0.429201 -0.113304
H  1.311787 -1.908714 1.026937
H  0.240185 0.824964 1.178496
H  1.532768 0.177611 2.187021
H  3.808539 0.406503 1.650409
H  4.400315 1.048083 0.124003
H  4.23651 -1.061895 -0.8580
H  3.574798 -1.754447 0.613744
H  1.034675 2.790279 0.036745
H  1.945903 -2.766344 -1.677668
H  0.936923 -1.539601 -2.441208
H  2.685646 -1.521485 -2.676563
H  3.353044 2.940359 2.027326
H  2.162939 4.19836 1.723342
H  1.658999 2.678451 2.443283
H  2.796095 2.917982 -1.734623
H  4.031523 3.129457 -0.494172
H  2.782662 4.343838 -0.708859
H  -0.921538 -1.29942 1.81744
H  -1.322782 -2.682656 0.812264
H  -2.365412 0.436142 2.122395
H  -5.066153 -0.92684 -1.759875
H  -1.88445 -2.346893 -1.91076
H  -2.869535 -3.413273 -0.92723
H  -3.573937 -2.610146 -2.322966
H  -4.461003 1.629559 1.616084
H  -5.811694 0.948814 -0.353779
elementType: O C H
totalener: -852.12129860 hartree
nucrepener: 1647.84844135 hartree
electener: -2499.96973996 hartree
oneelecener: -4430.52305142 hartree
twoeener: 1930.55331146 hartree
cpcmener: -0.02173725 hartree
kineticenergy: 848.05337970 hartree
xcener: -85.347135630066 hartree
chargesum: 0.0000000
charge: -0.414273 -0.369630 0.333174 0.340524 0.042838 -0.239306 -0.266266 -0.190801 0.025783 -0.303257 -0.317219 -0.299190 0.042621 -0.031007 -0.071503 -0.128612 -0.137801 -0.237557 -0.193022 -0.153995 0.074048 0.085895 0.097068 0.087770 0.099334 0.086260 0.084902 0.035282 0.097139 0.087940 0.095748 0.087438 0.096635 0.096766 0.094221 0.078597 0.095037 0.098248 0.106408 0.140055 0.137107 0.102829 0.101731 0.091344 0.154479 0.156222
qa: -0.4143 -0.3696 0.3332 0.3405 0.0428 -0.2393 -0.2663 -0.1908 0.0258 -0.3033 -0.3172 -0.2992 0.0426 -0.0310 -0.0715 -0.1286 -0.1378 -0.2376 -0.1930 -0.1540 0.0740 0.0859 0.0971 0.0878 0.0993 0.0863 0.0849 0.0353 0.0971 0.0879 0.0957 0.0874 0.0966 0.0968 0.0942 0.0786 0.0950 0.0982 0.1064 0.1401 0.1371 0.1028 0.1017 0.0913 0.1545 0.1562
va: 2.0402 1.9568 3.7526 3.7006 4.1146 3.8823 4.0281 3.9411 3.7353 3.9089 3.9520 3.9363 3.8622 3.6674 3.7800 3.8585 3.8702 3.9058 3.9351 3.9034 1.0099 1.0313 1.0095 1.0125 1.0084 1.0139 1.0154 1.0248 1.0011 1.0146 1.0084 0.9981 1.0045 1.0013 1.0170 1.0035 1.0031 0.9894 0.9937 0.9990 1.0009 1.0021 0.9962 1.0074 0.9929 0.9901
dispcorr: -0.022792581 hartree
energy: -852.144091185091
dipole: 13.38623 -12.95035 0.43588 4.16396 -4.75449 -0.59053 1.49263 -0.20211 1.29052
magnitude: 1.48464 au
magnitude: 3.77365 debye
