program: Orca
programVersion: 5.0.2
elementType: O O C C C C C C C C C C C C C C C C C C H H H H H H H H H H H H H H H H H H H H H H H H H H
charge: 0
multiplicity: 1
keywords: wb97x-d3
keywords: def2-TZVPP
keywords: def2/J RIJCOSX
keywords: DEFGRID2
keywords: scfconv7
keywords: smallprint printgap noloewdin
keywords: NOSOSCF
formula: C18H26O2
InChI: InChI=1/C18H26O2/c1-13(2)18-10-9-17(4,20-18)16(11-18)19-12-15-8-6-5-7-14(15)3/h5-8,13,16H,9-12H2,1-4H3
46 atoms
O  2.088441 0.134544 -1.070721
O  -0.323907 -0.778972 0.42809
C  2.544072 1.010036 -0.039588
C  1.957173 -1.05676 -0.298677
C  1.013087 -0.61684 0.836978
C  1.428732 0.858418 1.013618
C  3.776408 0.264248 0.514878
C  3.359212 -1.203134 0.317034
C  2.799181 2.418761 -0.569755
C  1.504879 -2.220342 -1.142054
C  3.799837 2.436436 -1.724911
C  1.525125 3.144137 -1.000678
C  -1.265272 -0.463378 1.430829
C  -2.645028 -0.718192 0.897308
C  -3.191231 0.09061 -0.111013
C  -3.386435 -1.779605 1.404032
C  -4.469853 -0.202075 -0.576991
C  -2.436074 1.254892 -0.682912
C  -4.663045 -2.056644 0.933804
C  -5.203859 -1.264142 -0.065188
H  1.189985 -1.209852 1.744208
H  0.583557 1.51055 0.789644
H  1.767782 1.098581 2.02142
H  3.965847 0.524196 1.556675
H  4.682703 0.494536 -0.044528
H  4.022065 -1.71349 -0.384119
H  3.351026 -1.786478 1.23843
H  3.238121 2.976884 0.265591
H  1.379978 -3.109362 -0.522413
H  0.557868 -2.027824 -1.645438
H  2.251273 -2.453524 -1.903196
H  4.750947 1.966626 -1.47435
H  3.403128 1.933564 -2.608535
H  4.021361 3.46596 -2.011136
H  0.835652 3.318403 -0.174727
H  0.988489 2.591086 -1.77435
H  1.772379 4.123274 -1.414755
H  -1.168942 0.583723 1.74861
H  -1.092562 -1.077535 2.325049
H  -2.956611 -2.400015 2.18202
H  -4.901477 0.416381 -1.355334
H  -3.037695 1.786403 -1.419268
H  -2.158325 1.974143 0.091193
H  -1.513651 0.941721 -1.17232
H  -5.225486 -2.885687 1.343714
H  -6.196849 -1.466381 -0.446531
elementType: O C H
totalener: -852.12143379 hartree
nucrepener: 1652.11059837 hartree
electener: -2504.23203216 hartree
oneelecener: -4438.97688133 hartree
twoeener: 1934.74484917 hartree
cpcmener: -0.02081429 hartree
kineticenergy: 848.05462586 hartree
xcener: -85.348980778646 hartree
chargesum: -0.0000000
charge: -0.428988 -0.361147 0.316313 0.305523 0.082666 -0.276272 -0.227027 -0.202887 0.071981 -0.305490 -0.303762 -0.317392 0.014511 -0.050375 -0.048579 -0.126753 -0.143013 -0.228130 -0.184309 -0.154737 0.080465 0.093377 0.096800 0.084812 0.098465 0.084700 0.084043 0.039972 0.097292 0.091912 0.094683 0.090978 0.083957 0.093335 0.088600 0.089775 0.096571 0.113622 0.091409 0.137178 0.137473 0.096503 0.097729 0.093414 0.155000 0.155802
qa: -0.4290 -0.3611 0.3163 0.3055 0.0827 -0.2763 -0.2270 -0.2029 0.0720 -0.3055 -0.3038 -0.3174 0.0145 -0.0504 -0.0486 -0.1268 -0.1430 -0.2281 -0.1843 -0.1547 0.0805 0.0934 0.0968 0.0848 0.0985 0.0847 0.0840 0.0400 0.0973 0.0919 0.0947 0.0910 0.0840 0.0933 0.0886 0.0898 0.0966 0.1136 0.0914 0.1372 0.1375 0.0965 0.0977 0.0934 0.1550 0.1558
va: 2.0291 1.9432 3.7303 3.7793 3.9419 3.9829 3.9950 3.9529 3.6822 3.9247 3.9461 3.9476 3.8782 3.6679 3.7276 3.8944 3.8848 3.8778 3.9202 3.9051 1.0167 1.0123 1.0203 1.0166 1.0106 1.0151 1.0167 1.0175 1.0018 1.0145 1.0071 1.0075 1.0099 1.0036 1.0018 1.0079 1.0061 0.9788 1.0066 1.0037 1.0022 1.0100 0.9986 1.0191 0.9926 0.9907
dispcorr: -0.023386843 hartree
energy: -852.144820634421
dipole: 13.62344 -13.06749 0.55595 9.14359 -8.82921 0.31439 -2.89268 4.24945 1.35677
magnitude: 1.49958 au
magnitude: 3.81163 debye
