program: Orca
programVersion: 5.0.2
elementType: O O C C C C C C C C C C C C C C C C C C H H H H H H H H H H H H H H H H H H H H H H H H H H
charge: 0
multiplicity: 1
keywords: wb97x-d3
keywords: def2-TZVPP
keywords: def2/J RIJCOSX
keywords: DEFGRID2
keywords: scfconv7
keywords: smallprint printgap noloewdin
keywords: NOSOSCF
formula: C18H26O2
InChI: InChI=1/C18H26O2/c1-13(2)18-10-9-17(4,20-18)16(11-18)19-12-15-8-6-5-7-14(15)3/h5-8,13,16H,9-12H2,1-4H3
46 atoms
O  2.061002 0.111998 -1.065418
O  -0.300053 -0.821892 0.442903
C  2.516064 1.004029 -0.048909
C  1.978324 -1.078428 -0.286482
C  1.035992 -0.658418 0.85618
C  1.44378 0.817312 1.046416
C  3.787806 0.297844 0.465023
C  3.392544 -1.181632 0.313309
C  2.694121 2.421708 -0.587273
C  1.548972 -2.260551 -1.116214
C  3.729354 2.503683 -1.708612
C  1.386602 3.04574 -1.075226
C  -1.244001 -0.54515 1.454711
C  -2.623573 -0.740144 0.896167
C  -3.145302 0.145065 -0.059399
C  -3.389656 -1.818022 1.325254
C  -4.42533 -0.08967 -0.553396
C  -2.361156 1.330037 -0.542966
C  -4.667748 -2.036756 0.828692
C  -5.184701 -1.168077 -0.118497
H  1.216644 -1.260965 1.756108
H  0.585137 1.469079 0.880669
H  1.827378 1.035986 2.043053
H  4.021121 0.582716 1.491239
H  4.66147 0.532089 -0.142279
H  4.056085 -1.701104 -0.380377
H  3.405688 -1.738233 1.251205
H  3.060818 3.018107 0.256447
H  1.453799 -3.146639 -0.487252
H  0.592108 -2.097526 -1.611081
H  2.293075 -2.48117 -1.88301
H  3.853334 3.539745 -2.027693
H  4.714308 2.146336 -1.40943
H  3.418473 1.930777 -2.584153
H  0.948107 2.469682 -1.892037
H  1.571149 4.052843 -1.452626
H  0.636598 3.138311 -0.290083
H  -1.130357 0.480295 1.831116
H  -1.090852 -1.211642 2.314044
H  -2.978739 -2.497666 2.062985
H  -4.838294 0.588165 -1.291404
H  -1.437132 1.031861 -1.038792
H  -2.941676 1.920567 -1.250779
H  -2.082994 1.990478 0.281571
H  -5.250007 -2.879554 1.178638
H  -6.178403 -1.324398 -0.519131
elementType: O C H
totalener: -852.12157157 hartree
nucrepener: 1655.67371897 hartree
electener: -2507.79529054 hartree
oneelecener: -4446.12111636 hartree
twoeener: 1938.32582582 hartree
cpcmener: -0.02098822 hartree
kineticenergy: 848.05438584 hartree
xcener: -85.349436026805 hartree
chargesum: -0.0000000
charge: -0.429049 -0.362847 0.316958 0.305382 0.081635 -0.282732 -0.231213 -0.197599 0.078336 -0.304371 -0.306571 -0.319539 0.010844 -0.057242 -0.034352 -0.126597 -0.144919 -0.234474 -0.184508 -0.154124 0.080262 0.098012 0.099023 0.083896 0.099775 0.085488 0.084619 0.039822 0.096910 0.091160 0.094469 0.093362 0.089159 0.086046 0.088922 0.098445 0.086650 0.114226 0.091748 0.137017 0.136611 0.094815 0.096660 0.099121 0.154949 0.155815
qa: -0.4290 -0.3628 0.3170 0.3054 0.0816 -0.2827 -0.2312 -0.1976 0.0783 -0.3044 -0.3066 -0.3195 0.0108 -0.0572 -0.0344 -0.1266 -0.1449 -0.2345 -0.1845 -0.1541 0.0803 0.0980 0.0990 0.0839 0.0998 0.0855 0.0846 0.0398 0.0969 0.0912 0.0945 0.0934 0.0892 0.0860 0.0889 0.0984 0.0867 0.1142 0.0917 0.1370 0.1366 0.0948 0.0967 0.0991 0.1549 0.1558
va: 2.0318 1.9410 3.7267 3.7823 3.9412 3.9775 3.9951 3.9488 3.6745 3.9221 3.9427 3.9496 3.8818 3.6710 3.7049 3.8950 3.8908 3.8702 3.9188 3.9044 1.0167 1.0099 1.0201 1.0174 1.0105 1.0144 1.0162 1.0179 1.0015 1.0158 1.0071 1.0039 1.0075 1.0105 1.0076 1.0071 1.0023 0.9790 1.0066 1.0035 1.0029 1.0194 1.0113 0.9979 0.9925 0.9907
dispcorr: -0.023617544 hartree
energy: -852.145189111521
dipole: 13.49659 -12.91946 0.57713 9.14775 -8.83485 0.31289 -2.75830 4.12897 1.37067
magnitude: 1.51977 au
magnitude: 3.86295 debye
