program: Orca
programVersion: 5.0.2
elementType: O O C C C C C C C C C C C C C C C C C C H H H H H H H H H H H H H H H H H H H H H H H H H H
charge: 0
multiplicity: 1
keywords: wb97x-d3
keywords: def2-TZVPP
keywords: def2/J RIJCOSX
keywords: DEFGRID2
keywords: scfconv7
keywords: smallprint printgap noloewdin
keywords: NOSOSCF
formula: C18H26O2
InChI: InChI=1/C18H26O2/c1-13(2)18-10-9-17(4,20-18)16(11-18)19-12-15-8-6-5-7-14(15)3/h5-8,13,16H,9-12H2,1-4H3
46 atoms
O  2.146243 0.098679 -1.061882
O  -0.501216 -0.326848 0.299373
C  2.502207 1.183164 -0.203475
C  1.879197 -0.884673 -0.06337
C  0.807964 -0.184752 0.805729
C  1.255666 1.282628 0.693005
C  3.639269 0.578159 0.642042
C  3.186922 -0.88995 0.747467
C  2.820101 2.435464 -1.007291
C  1.502447 -2.205613 -0.681213
C  3.164072 3.597041 -0.080636
C  3.927985 2.223412 -2.034587
C  -1.289481 -1.289336 0.971394
C  -2.683139 -1.23877 0.417127
C  -3.541747 -0.171091 0.720342
C  -3.123195 -2.25781 -0.42021
C  -4.820235 -0.169548 0.169842
C  -3.11796 0.944951 1.630202
C  -4.402327 -2.245971 -0.959577
C  -5.253129 -1.19373 -0.662299
H  0.8496 -0.550077 1.838543
H  0.476936 1.87074 0.199888
H  1.455633 1.740713 1.661296
H  3.735283 1.068816 1.610635
H  4.603767 0.659394 0.139293
H  3.911868 -1.564217 0.287738
H  3.03714 -1.227852 1.773953
H  1.905829 2.702314 -1.551184
H  2.305682 -2.570886 -1.323459
H  1.339558 -2.955675 0.093265
H  0.595345 -2.136232 -1.282548
H  3.340377 4.50727 -0.656357
H  2.361838 3.814395 0.626247
H  4.070804 3.398549 0.49529
H  4.887463 2.003334 -1.562584
H  4.065364 3.128118 -2.629604
H  3.702555 1.412478 -2.727336
H  -1.298723 -1.082951 2.050334
H  -0.881218 -2.299438 0.850519
H  -2.452345 -3.077652 -0.650517
H  -5.492686 0.648699 0.399929
H  -3.916237 1.676391 1.750467
H  -2.859498 0.576351 2.625602
H  -2.242212 1.471599 1.25013
H  -4.727844 -3.051139 -1.605747
H  -6.254304 -1.166989 -1.073797
elementType: O C H
totalener: -852.12278336 hartree
nucrepener: 1630.77009550 hartree
electener: -2482.89287886 hartree
oneelecener: -4396.20095991 hartree
twoeener: 1913.30808106 hartree
cpcmener: -0.02179205 hartree
kineticenergy: 848.05747353 hartree
xcener: -85.347113849456 hartree
chargesum: -0.0000000
charge: -0.417018 -0.374873 0.341478 0.376157 0.093936 -0.271496 -0.246853 -0.219917 0.019053 -0.343271 -0.316398 -0.297829 0.011983 -0.028529 -0.076264 -0.118770 -0.141099 -0.225087 -0.195278 -0.149725 0.066157 0.082749 0.097265 0.088099 0.100595 0.083928 0.085354 0.036975 0.098696 0.098776 0.096159 0.096375 0.096405 0.086580 0.078483 0.095140 0.093521 0.115829 0.104161 0.137780 0.137321 0.092850 0.099585 0.100644 0.154752 0.155622
qa: -0.4170 -0.3749 0.3415 0.3762 0.0939 -0.2715 -0.2469 -0.2199 0.0191 -0.3433 -0.3164 -0.2978 0.0120 -0.0285 -0.0763 -0.1188 -0.1411 -0.2251 -0.1953 -0.1497 0.0662 0.0827 0.0973 0.0881 0.1006 0.0839 0.0854 0.0370 0.0987 0.0988 0.0962 0.0964 0.0964 0.0866 0.0785 0.0951 0.0935 0.1158 0.1042 0.1378 0.1373 0.0929 0.0996 0.1006 0.1548 0.1556
va: 2.0341 1.9299 3.7421 3.6598 4.0098 4.0190 4.0069 3.9858 3.7473 3.9052 3.9505 3.9347 3.8695 3.6205 3.7876 3.8780 3.8753 3.8949 3.9337 3.9002 1.0135 1.0399 1.0098 1.0124 1.0074 1.0152 1.0107 1.0235 1.0114 0.9992 1.0143 1.0043 1.0021 0.9982 1.0038 1.0033 1.0174 0.9887 0.9879 1.0025 1.0012 1.0076 0.9990 1.0053 0.9929 0.9906
dispcorr: -0.022732287 hartree
energy: -852.145515643058
dipole: 15.48851 -15.10119 0.38732 8.47433 -8.58351 -0.10917 2.54028 -1.03773 1.50255
magnitude: 1.55550 au
magnitude: 3.95378 debye
