program: Orca
programVersion: 5.0.2
elementType: O O C C C C C C C C C C C C C C C C C C H H H H H H H H H H H H H H H H H H H H H H H H H H
charge: 0
multiplicity: 1
keywords: wb97x-d3
keywords: def2-TZVPP
keywords: def2/J RIJCOSX
keywords: DEFGRID2
keywords: scfconv7
keywords: smallprint printgap noloewdin
keywords: NOSOSCF
formula: C18H26O2
InChI: InChI=1/C18H26O2/c1-13(2)18-10-9-17(4,20-18)16(11-18)19-12-15-8-6-5-7-14(15)3/h5-8,13,16H,9-12H2,1-4H3
46 atoms
O  1.98648 0.954337 -0.887929
O  -0.457799 -0.239004 0.366939
C  2.653414 1.103952 0.365812
C  1.703341 -0.441671 -0.814731
C  0.912986 -0.542876 0.511594
C  1.596591 0.556003 1.341687
C  3.782268 0.060279 0.2643
C  3.095491 -1.046478 -0.557629
C  3.053245 2.553324 0.606838
C  1.015223 -0.927426 -2.064054
C  3.724526 2.705959 1.968718
C  3.94042 3.127595 -0.493474
C  -1.298551 -1.358398 0.280196
C  -2.721585 -0.931439 0.049153
C  -3.71528 -1.918489 -0.035204
C  -3.071914 0.407266 -0.085659
C  -5.032358 -1.530381 -0.254864
C  -3.368828 -3.37132 0.106225
C  -4.393532 0.777852 -0.302512
C  -5.377953 -0.192102 -0.388063
H  1.028691 -1.535729 0.961373
H  0.871096 1.333155 1.594774
H  2.022813 0.181194 2.271651
H  4.116563 -0.27906 1.244521
H  4.652603 0.458354 -0.25897
H  3.610318 -1.217915 -1.504757
H  3.042091 -2.00569 -0.040894
H  2.12378 3.135189 0.624332
H  1.630259 -0.724528 -2.941778
H  0.861949 -2.005678 -2.017095
H  0.045854 -0.451437 -2.214849
H  3.08366 2.37261 2.786242
H  4.65588 2.138076 2.022671
H  3.971536 3.751589 2.158945
H  3.487762 3.03717 -1.480672
H  4.917429 2.641467 -0.526643
H  4.11825 4.188827 -0.314443
H  -1.23678 -1.951612 1.205405
H  -0.990128 -2.033441 -0.529513
H  -2.313758 1.175555 -0.022446
H  -5.801206 -2.291464 -0.322164
H  -2.921016 -3.58924 1.078678
H  -4.253243 -3.998725 0.005479
H  -2.649672 -3.693414 -0.650625
H  -4.647464 1.825408 -0.403763
H  -6.410364 0.086183 -0.557556
elementType: O C H
totalener: -852.12342794 hartree
nucrepener: 1621.89475225 hartree
electener: -2474.01818018 hartree
oneelecener: -4378.27148046 hartree
twoeener: 1904.25330028 hartree
cpcmener: -0.02084224 hartree
kineticenergy: 848.05046084 hartree
xcener: -85.350290299731 hartree
chargesum: -0.0000000
charge: -0.416460 -0.374635 0.330801 0.357135 0.093973 -0.248788 -0.247271 -0.215595 0.017688 -0.342458 -0.315539 -0.296738 0.033455 0.081359 -0.113548 -0.218704 -0.120816 -0.246477 -0.174055 -0.174394 0.077686 0.084920 0.096278 0.086441 0.102256 0.081640 0.085892 0.036142 0.099291 0.100230 0.098445 0.095614 0.087475 0.096057 0.093019 0.078174 0.095577 0.107675 0.101688 0.141085 0.136981 0.103691 0.091807 0.103627 0.154574 0.154800
qa: -0.4165 -0.3746 0.3308 0.3571 0.0940 -0.2488 -0.2473 -0.2156 0.0177 -0.3425 -0.3155 -0.2967 0.0335 0.0814 -0.1135 -0.2187 -0.1208 -0.2465 -0.1741 -0.1744 0.0777 0.0849 0.0963 0.0864 0.1023 0.0816 0.0859 0.0361 0.0993 0.1002 0.0984 0.0956 0.0875 0.0961 0.0930 0.0782 0.0956 0.1077 0.1017 0.1411 0.1370 0.1037 0.0918 0.1036 0.1546 0.1548
va: 2.0312 1.9372 3.7411 3.7142 3.9111 4.0260 4.0064 3.9848 3.7528 3.8983 3.9496 3.9344 3.8855 3.4996 3.8656 3.9528 3.8504 3.9360 3.9184 3.9128 1.0109 1.0379 1.0126 1.0136 1.0058 1.0171 1.0114 1.0240 1.0121 0.9978 1.0113 1.0025 0.9980 1.0043 1.0176 1.0037 1.0034 0.9933 0.9655 1.0279 1.0008 0.9962 1.0068 0.9944 0.9929 0.9909
dispcorr: -0.022160364 hartree
energy: -852.145588301738
dipole: 16.02823 -15.31854 0.70969 0.49113 -1.90959 -1.41846 2.04082 -1.35581 0.68501
magnitude: 1.72770 au
magnitude: 4.39145 debye
