program: Orca
programVersion: 5.0.2
elementType: O O C C C C C C C C C C C C C C C C C C H H H H H H H H H H H H H H H H H H H H H H H H H H
charge: 0
multiplicity: 1
keywords: wb97x-d3
keywords: def2-TZVPP
keywords: def2/J RIJCOSX
keywords: DEFGRID2
keywords: scfconv7
keywords: smallprint printgap noloewdin
keywords: NOSOSCF
formula: C18H26O2
InChI: InChI=1/C18H26O2/c1-13(2)18-10-9-17(4,20-18)16(11-18)19-12-15-8-6-5-7-14(15)3/h5-8,13,16H,9-12H2,1-4H3
46 atoms
O  2.255415 0.244092 -1.059923
O  -0.342887 -0.686423 0.04354
C  2.534953 1.130743 0.024508
C  2.030081 -0.945557 -0.307669
C  0.911209 -0.516769 0.660605
C  1.275751 0.962899 0.898492
C  3.696906 0.418053 0.741432
C  3.324791 -1.059376 0.518837
C  2.782484 2.546779 -0.476992
C  1.731401 -2.126915 -1.194847
C  3.028269 3.497041 0.691332
C  3.92112 2.635102 -1.488567
C  -1.423782 -0.522528 0.919968
C  -2.727685 -0.744592 0.203737
C  -3.917192 -0.743993 0.948444
C  -2.782442 -0.934537 -1.17247
C  -5.124844 -0.940511 0.287489
C  -3.895381 -0.536969 2.434345
C  -3.997718 -1.12756 -1.817469
C  -5.173911 -1.132641 -1.086864
H  0.945855 -1.108611 1.584574
H  0.476036 1.61591 0.53719
H  1.450915 1.199068 1.947683
H  3.760394 0.691427 1.794568
H  4.657893 0.655641 0.283457
H  4.090142 -1.579998 -0.05935
H  3.180443 -1.619285 1.443569
H  1.861572 2.866495 -0.979702
H  1.516063 -3.006217 -0.58605
H  0.8747 -1.953174 -1.844967
H  2.591009 -2.364906 -1.822235
H  2.199399 3.503928 1.400766
H  3.935229 3.234707 1.240702
H  3.152778 4.520069 0.332302
H  4.884859 2.383208 -1.041552
H  4.003731 3.65291 -1.872935
H  3.767057 1.977454 -2.34429
H  -1.424781 0.483593 1.366839
H  -1.33881 -1.225059 1.763078
H  -1.873472 -0.931791 -1.757926
H  -6.044351 -0.942553 0.861437
H  -3.331812 -1.321321 2.945113
H  -3.429888 0.413153 2.706354
H  -4.903718 -0.537658 2.846183
H  -4.018786 -1.273014 -2.890085
H  -6.126359 -1.283636 -1.579086
elementType: O C H
totalener: -852.12433659 hartree
nucrepener: 1621.35030881 hartree
electener: -2473.47464540 hartree
oneelecener: -4377.17380800 hartree
twoeener: 1903.69916260 hartree
cpcmener: -0.02069982 hartree
kineticenergy: 848.04268874 hartree
xcener: -85.349179973669 hartree
chargesum: 0.0000000
charge: -0.415036 -0.355898 0.340463 0.351181 0.044366 -0.276461 -0.255961 -0.203236 0.027485 -0.303496 -0.317502 -0.298164 0.054103 0.072019 -0.102626 -0.217653 -0.125404 -0.246966 -0.178699 -0.171563 0.077939 0.096879 0.096488 0.087392 0.102645 0.086106 0.083790 0.035958 0.097320 0.091215 0.095253 0.096936 0.087227 0.096878 0.078772 0.095345 0.093808 0.096219 0.091112 0.146613 0.136493 0.106207 0.102578 0.091006 0.153794 0.155074
qa: -0.4150 -0.3559 0.3405 0.3512 0.0444 -0.2765 -0.2560 -0.2032 0.0275 -0.3035 -0.3175 -0.2982 0.0541 0.0720 -0.1026 -0.2177 -0.1254 -0.2470 -0.1787 -0.1716 0.0779 0.0969 0.0965 0.0874 0.1026 0.0861 0.0838 0.0360 0.0973 0.0912 0.0953 0.0969 0.0872 0.0969 0.0788 0.0953 0.0938 0.0962 0.0911 0.1466 0.1365 0.1062 0.1026 0.0910 0.1538 0.1551
va: 2.0432 1.9763 3.7375 3.7149 4.0206 3.9330 4.0151 3.9613 3.7370 3.9204 3.9528 3.9350 3.8777 3.5151 3.8549 3.9466 3.8558 3.9365 3.9277 3.9097 1.0155 1.0222 1.0107 1.0122 1.0063 1.0142 1.0156 1.0246 1.0016 1.0095 1.0077 1.0008 0.9982 1.0041 1.0037 1.0034 1.0173 0.9799 0.9906 1.0184 1.0011 0.9949 0.9945 1.0069 0.9934 0.9907
dispcorr: -0.021930918 hartree
energy: -852.146267512928
dipole: 13.97841 -13.64974 0.32867 7.60481 -7.47082 0.13399 5.91845 -4.14443 1.77402
magnitude: 1.80918 au
magnitude: 4.59857 debye
