program: Orca
programVersion: 5.0.2
elementType: O O C C C C C C C C C C C C C C C C C C H H H H H H H H H H H H H H H H H H H H H H H H H H
charge: 0
multiplicity: 1
keywords: wb97x-d3
keywords: def2-TZVPP
keywords: def2/J RIJCOSX
keywords: DEFGRID2
keywords: scfconv7
keywords: smallprint printgap noloewdin
keywords: NOSOSCF
formula: C18H26O2
InChI: InChI=1/C18H26O2/c1-13(2)18-10-9-17(4,20-18)16(11-18)19-12-15-8-6-5-7-14(15)3/h5-8,13,16H,9-12H2,1-4H3
46 atoms
O  1.989983 0.829826 -1.054743
O  -0.477133 -0.464256 0.02057
C  2.553722 1.089882 0.230599
C  1.757331 -0.568006 -0.907294
C  0.880028 -0.62856 0.357859
C  1.454598 0.551732 1.169277
C  3.730664 0.097774 0.278755
C  3.151021 -1.091734 -0.509115
C  2.877387 2.568175 0.399017
C  1.178413 -1.17493 -2.158713
C  3.450261 2.838138 1.786955
C  3.813425 3.108515 -0.677944
C  -1.355954 -0.773416 1.082112
C  -2.771399 -0.711855 0.584243
C  -3.284421 -1.704623 -0.264541
C  -3.5846 0.348925 0.967776
C  -4.599678 -1.588418 -0.705667
C  -2.460799 -2.888484 -0.679373
C  -4.897449 0.448283 0.527401
C  -5.40423 -0.524955 -0.318358
H  1.012793 -1.58871 0.873304
H  0.685759 1.313336 1.328719
H  1.837408 0.256928 2.146044
H  4.012161 -0.15888 1.299954
H  4.617103 0.50213 -0.211841
H  3.740914 -1.304597 -1.402429
H  3.098209 -2.014457 0.069961
H  1.92747 3.110225 0.318054
H  0.980067 -2.236391 -2.004512
H  0.245414 -0.697911 -2.457008
H  1.882226 -1.091332 -2.988225
H  4.404367 2.327692 1.936392
H  3.630459 3.905579 1.925286
H  2.77507 2.520043 2.582834
H  3.955529 4.182598 -0.546109
H  3.422181 2.955757 -1.68391
H  4.80214 2.647907 -0.630043
H  -1.229272 -0.072393 1.917083
H  -1.132574 -1.774186 1.478219
H  -3.183294 1.110407 1.626796
H  -5.004361 -2.349563 -1.362658
H  -2.149805 -3.481724 0.183733
H  -3.025443 -3.545663 -1.339628
H  -1.552478 -2.593888 -1.204902
H  -5.515337 1.279418 0.842408
H  -6.424561 -0.462913 -0.675434
elementType: O C H
totalener: -852.12395323 hartree
nucrepener: 1630.57388794 hartree
electener: -2482.69784116 hartree
oneelecener: -4395.77991736 hartree
twoeener: 1913.08207620 hartree
cpcmener: -0.02149623 hartree
kineticenergy: 848.04724566 hartree
xcener: -85.346002213841 hartree
chargesum: 0.0000000
charge: -0.413545 -0.360073 0.338546 0.374612 0.044493 -0.266549 -0.254620 -0.204825 0.025900 -0.332981 -0.315958 -0.297872 0.022580 -0.047373 -0.057832 -0.120055 -0.144595 -0.224150 -0.190153 -0.149947 0.071684 0.090964 0.096464 0.087711 0.100926 0.085717 0.084439 0.036027 0.095518 0.094002 0.101370 0.086565 0.096635 0.096367 0.094988 0.093703 0.078669 0.093211 0.107917 0.138381 0.137376 0.100845 0.094699 0.099451 0.154776 0.155993
qa: -0.4135 -0.3601 0.3385 0.3746 0.0445 -0.2665 -0.2546 -0.2048 0.0259 -0.3330 -0.3160 -0.2979 0.0226 -0.0474 -0.0578 -0.1201 -0.1446 -0.2241 -0.1902 -0.1499 0.0717 0.0910 0.0965 0.0877 0.1009 0.0857 0.0844 0.0360 0.0955 0.0940 0.1014 0.0866 0.0966 0.0964 0.0950 0.0937 0.0787 0.0932 0.1079 0.1384 0.1374 0.1008 0.0947 0.0995 0.1548 0.1560
va: 2.0463 1.9479 3.7483 3.6632 4.0841 3.9355 4.0169 3.9608 3.7347 3.9015 3.9525 3.9363 3.8808 3.6661 3.7530 3.8823 3.8773 3.8976 3.9247 3.9001 1.0168 1.0271 1.0097 1.0121 1.0075 1.0142 1.0140 1.0240 0.9997 1.0150 1.0099 0.9984 1.0042 1.0013 1.0033 1.0169 1.0039 0.9937 0.9875 1.0024 1.0015 0.9989 1.0078 0.9979 0.9927 0.9905
dispcorr: -0.022671770 hartree
energy: -852.146624996175
dipole: 16.73509 -16.19262 0.54247 2.45435 -3.30362 -0.84928 1.92973 -0.71660 1.21313
magnitude: 1.57710 au
magnitude: 4.00866 debye
