program: Orca
programVersion: 5.0.2
elementType: O O C C C C C C C C C C C C C C C C C C H H H H H H H H H H H H H H H H H H H H H H H H H H
charge: 0
multiplicity: 1
keywords: wb97x-d3
keywords: def2-TZVPP
keywords: def2/J RIJCOSX
keywords: DEFGRID2
keywords: scfconv7
keywords: smallprint printgap noloewdin
keywords: NOSOSCF
formula: C18H26O2
InChI: InChI=1/C18H26O2/c1-13(2)18-10-9-17(4,20-18)16(11-18)19-12-15-8-6-5-7-14(15)3/h5-8,13,16H,9-12H2,1-4H3
46 atoms
O  2.049481 0.055959 -1.084309
O  -0.389992 -0.735422 0.412134
C  2.432993 1.077871 -0.164743
C  1.932818 -1.025211 -0.163763
C  0.919354 -0.47728 0.8589
C  1.285354 1.020436 0.861461
C  3.682629 0.471946 0.500078
C  3.313184 -1.022993 0.520422
C  2.588705 2.418292 -0.866987
C  1.562129 -2.312955 -0.853154
C  2.973947 3.503803 0.133091
C  3.57561 2.379371 -2.028359
C  -1.383975 -0.328657 1.327888
C  -2.726019 -0.736421 0.795509
C  -3.291921 -0.084612 -0.310366
C  -3.407867 -1.787171 1.398527
C  -4.531838 -0.516611 -0.772801
C  -2.593562 1.058771 -0.987664
C  -4.645088 -2.206069 0.928921
C  -5.207359 -1.566458 -0.163802
H  1.065588 -0.940972 1.843709
H  0.443619 1.624969 0.511445
H  1.57077 1.391086 1.845584
H  3.860864 0.883779 1.493466
H  4.581205 0.649291 -0.092671
H  4.020313 -1.616435 -0.061922
H  3.280873 -1.450702 1.523266
H  1.603308 2.674823 -1.275109
H  0.636754 -2.228508 -1.422414
H  2.352847 -2.625686 -1.536834
H  1.430855 -3.10838 -0.118316
H  3.954189 3.314817 0.576379
H  3.023132 4.477638 -0.356856
H  2.252524 3.589851 0.947447
H  3.602987 3.348485 -2.529879
H  3.302968 1.635899 -2.7778
H  4.592647 2.161908 -1.695937
H  -1.352163 0.75696 1.489254
H  -1.213427 -0.794235 2.307892
H  -2.962553 -2.285582 2.251877
H  -4.979335 -0.019153 -1.625459
H  -2.395033 1.877967 -0.292669
H  -1.632402 0.758287 -1.406476
H  -3.197683 1.459807 -1.800757
H  -5.161977 -3.024763 1.412983
H  -6.170989 -1.880844 -0.544499
elementType: O C H
totalener: -852.12425403 hartree
nucrepener: 1641.58845329 hartree
electener: -2493.71270732 hartree
oneelecener: -4417.82282006 hartree
twoeener: 1924.11011274 hartree
cpcmener: -0.02091658 hartree
kineticenergy: 848.06418256 hartree
xcener: -85.349647419180 hartree
chargesum: 0.0000000
charge: -0.418437 -0.360238 0.357904 0.321108 0.073627 -0.288845 -0.254824 -0.199222 0.018718 -0.300878 -0.317610 -0.293657 0.019687 -0.042852 -0.061412 -0.126505 -0.139801 -0.226391 -0.183502 -0.154248 0.081677 0.099241 0.097965 0.088366 0.101096 0.085543 0.085161 0.037226 0.090742 0.094436 0.096391 0.087428 0.097055 0.097087 0.094598 0.092589 0.078411 0.112667 0.089631 0.135453 0.136525 0.098298 0.094256 0.096062 0.154285 0.155188
qa: -0.4184 -0.3602 0.3579 0.3211 0.0736 -0.2888 -0.2548 -0.1992 0.0187 -0.3009 -0.3176 -0.2937 0.0197 -0.0429 -0.0614 -0.1265 -0.1398 -0.2264 -0.1835 -0.1542 0.0817 0.0992 0.0980 0.0884 0.1011 0.0855 0.0852 0.0372 0.0907 0.0944 0.0964 0.0874 0.0971 0.0971 0.0946 0.0926 0.0784 0.1127 0.0896 0.1355 0.1365 0.0983 0.0943 0.0961 0.1543 0.1552
va: 2.0268 1.9464 3.6903 3.7403 3.9787 3.9543 4.0251 3.9619 3.7554 3.9169 3.9530 3.9358 3.8770 3.6536 3.7477 3.8918 3.8749 3.8783 3.9175 3.9032 1.0169 1.0128 1.0135 1.0114 1.0070 1.0154 1.0158 1.0210 1.0153 1.0074 1.0019 0.9981 1.0043 1.0006 1.0032 1.0169 1.0042 0.9800 1.0059 1.0040 1.0021 0.9992 1.0192 1.0094 0.9928 0.9908
dispcorr: -0.022851153 hartree
energy: -852.147105179206
dipole: 15.43340 -14.99198 0.44142 10.12008 -9.62433 0.49575 -1.26797 2.57861 1.31064
magnitude: 1.46915 au
magnitude: 3.73428 debye
