program: Orca
programVersion: 5.0.2
elementType: O O C C C C C C C C C C C C C C C C C C H H H H H H H H H H H H H H H H H H H H H H H H H H
charge: 0
multiplicity: 1
keywords: wb97x-d3
keywords: def2-TZVPP
keywords: def2/J RIJCOSX
keywords: DEFGRID2
keywords: scfconv7
keywords: smallprint printgap noloewdin
keywords: NOSOSCF
formula: C18H26O2
InChI: InChI=1/C18H26O2/c1-13(2)18-10-9-17(4,20-18)16(11-18)19-12-15-8-6-5-7-14(15)3/h5-8,13,16H,9-12H2,1-4H3
46 atoms
O  2.001135 0.056241 -1.092565
O  -0.361439 -0.815427 0.449927
C  2.390554 1.07229 -0.167785
C  1.947537 -1.044109 -0.187967
C  0.952133 -0.542681 0.874703
C  1.287292 0.962763 0.901776
C  3.680683 0.489734 0.436539
C  3.349518 -1.013961 0.449692
C  2.481999 2.429364 -0.849588
C  1.592981 -2.329899 -0.889123
C  2.875452 3.507561 0.155547
C  3.426662 2.438089 -2.046195
C  -1.348133 -0.447298 1.38857
C  -2.698219 -0.771543 0.81918
C  -3.214169 -0.049474 -0.267871
C  -3.439679 -1.810968 1.369073
C  -4.464223 -0.404561 -0.766684
C  -2.457135 1.089429 -0.886956
C  -4.687614 -2.151079 0.864583
C  -5.198668 -1.444704 -0.211783
H  1.132968 -1.026355 1.84406
H  0.419247 1.558403 0.605379
H  1.606721 1.313127 1.882909
H  3.888476 0.892533 1.427764
H  4.549448 0.69819 -0.189553
H  4.051512 -1.582352 -0.162917
H  3.361184 -1.454543 1.4474
H  1.475345 2.665315 -1.216303
H  0.641601 -2.268709 -1.416542
H  2.364939 -2.597759 -1.612498
H  1.524051 -3.144659 -0.166776
H  2.178536 3.566144 0.993298
H  3.873157 3.332941 0.564214
H  2.888751 4.48923 -0.320883
H  4.462505 2.258529 -1.751261
H  3.397745 3.4116 -2.539249
H  3.156516 1.690289 -2.792101
H  -1.286263 0.622684 1.629238
H  -1.199654 -0.988006 2.333203
H  -3.032991 -2.363604 2.208164
H  -4.872461 0.146324 -1.606052
H  -3.037168 1.557059 -1.681781
H  -2.224942 1.864134 -0.152332
H  -1.508895 0.764214 -1.31597
H  -5.251406 -2.961567 1.308312
H  -6.168949 -1.697154 -0.620704
elementType: O C H
totalener: -852.12399693 hartree
nucrepener: 1645.83036069 hartree
electener: -2497.95435762 hartree
oneelecener: -4426.30811268 hartree
twoeener: 1928.35375506 hartree
cpcmener: -0.02083638 hartree
kineticenergy: 848.06165065 hartree
xcener: -85.349299384138 hartree
chargesum: 0.0000000
charge: -0.421599 -0.360934 0.362762 0.320450 0.080765 -0.298774 -0.256022 -0.196804 0.018618 -0.300833 -0.318065 -0.294951 0.012469 -0.047154 -0.048374 -0.126789 -0.144394 -0.230371 -0.183549 -0.154950 0.081518 0.101728 0.100144 0.088065 0.100634 0.085570 0.085875 0.037905 0.090859 0.094493 0.096239 0.096945 0.087874 0.096877 0.078776 0.094992 0.092859 0.115075 0.089555 0.136928 0.137081 0.096526 0.098341 0.092986 0.154950 0.155702
qa: -0.4216 -0.3609 0.3628 0.3204 0.0808 -0.2988 -0.2560 -0.1968 0.0186 -0.3008 -0.3181 -0.2950 0.0125 -0.0472 -0.0484 -0.1268 -0.1444 -0.2304 -0.1835 -0.1549 0.0815 0.1017 0.1001 0.0881 0.1006 0.0856 0.0859 0.0379 0.0909 0.0945 0.0962 0.0969 0.0879 0.0969 0.0788 0.0950 0.0929 0.1151 0.0896 0.1369 0.1371 0.0965 0.0983 0.0930 0.1550 0.1557
va: 2.0201 1.9452 3.6707 3.7430 3.9669 3.9608 4.0301 3.9609 3.7598 3.9175 3.9536 3.9346 3.8811 3.6621 3.7267 3.8932 3.8825 3.8745 3.9196 3.9042 1.0165 1.0109 1.0139 1.0117 1.0070 1.0154 1.0155 1.0195 1.0156 1.0073 1.0016 1.0007 0.9981 1.0042 1.0037 1.0034 1.0172 0.9800 1.0062 1.0039 1.0022 1.0105 0.9989 1.0223 0.9926 0.9907
dispcorr: -0.023077155 hartree
energy: -852.147074089185
dipole: 15.36182 -14.86969 0.49213 10.20989 -9.72993 0.47996 -1.25199 2.56744 1.31546
magnitude: 1.48424 au
magnitude: 3.77265 debye
