program: Orca
programVersion: 5.0.2
elementType: O O C C C C C C C C C C C C C C C C C C H H H H H H H H H H H H H H H H H H H H H H H H H H
charge: 0
multiplicity: 1
keywords: wb97x-d3
keywords: def2-TZVPP
keywords: def2/J RIJCOSX
keywords: DEFGRID2
keywords: scfconv7
keywords: smallprint printgap noloewdin
keywords: NOSOSCF
formula: C18H26O2
InChI: InChI=1/C18H26O2/c1-13(2)18-10-9-17(4,20-18)16(11-18)19-12-15-8-6-5-7-14(15)3/h5-8,13,16H,9-12H2,1-4H3
46 atoms
O  1.93045 0.233802 -0.932294
O  0.027729 -1.835802 -0.213846
C  1.850968 0.954236 0.298891
C  2.277549 -1.045451 -0.406726
C  1.099905 -1.318547 0.544782
C  0.861506 0.094795 1.115888
C  3.250365 0.724101 0.891841
C  3.512727 -0.730272 0.46061
C  1.407036 2.391348 0.06748
C  2.51493 -2.056936 -1.498512
C  1.314505 3.142698 1.392168
C  2.294983 3.146689 -0.916011
C  -1.212072 -1.928074 0.437412
C  -2.220391 -0.924788 -0.069296
C  -3.478745 -0.848484 0.545476
C  -1.932761 -0.093391 -1.146207
C  -4.405797 0.07372 0.069143
C  -3.822186 -1.73628 1.705175
C  -2.870944 0.818349 -1.613424
C  -4.111249 0.906342 -1.002376
H  1.373862 -2.03788 1.326538
H  -0.165154 0.430545 0.957457
H  1.053988 0.14386 2.187546
H  3.272582 0.863068 1.972573
H  3.985635 1.403995 0.458461
H  4.42365 -0.815277 -0.134231
H  3.611364 -1.420021 1.3004
H  0.397559 2.344042 -0.359806
H  1.653699 -2.174189 -2.155469
H  3.370643 -1.767098 -2.110731
H  2.740599 -3.031165 -1.062821
H  2.292978 3.243441 1.867549
H  0.926443 4.150338 1.234034
H  0.648242 2.649206 2.101836
H  1.887617 4.142424 -1.099337
H  2.367435 2.645171 -1.881074
H  3.308199 3.281626 -0.532699
H  -1.10176 -1.829947 1.52489
H  -1.603061 -2.939835 0.271607
H  -0.962426 -0.141609 -1.622783
H  -5.376914 0.139182 0.5465
H  -3.17198 -1.552382 2.56439
H  -4.848999 -1.576425 2.032741
H  -3.718671 -2.794521 1.453769
H  -2.626519 1.459684 -2.450874
H  -4.848507 1.616571 -1.355421
elementType: O C H
totalener: -852.12057069 hartree
nucrepener: 1680.72267210 hartree
electener: -2532.84324279 hartree
oneelecener: -4496.08843167 hartree
twoeener: 1963.24518888 hartree
cpcmener: -0.01922864 hartree
kineticenergy: 848.04161512 hartree
xcener: -85.351150062328 hartree
chargesum: 0.0000000
charge: -0.426876 -0.387271 0.364451 0.314382 0.077272 -0.308806 -0.267511 -0.176537 0.025569 -0.302747 -0.317092 -0.298868 0.007374 0.071795 -0.103012 -0.215979 -0.123194 -0.242775 -0.163108 -0.177197 0.095562 0.121969 0.103146 0.086695 0.099801 0.084998 0.087091 0.031179 0.092439 0.094719 0.097342 0.087933 0.097151 0.097663 0.095960 0.093686 0.080263 0.106877 0.115478 0.133653 0.136184 0.104999 0.091682 0.104812 0.154542 0.154305
qa: -0.4269 -0.3873 0.3645 0.3144 0.0773 -0.3088 -0.2675 -0.1765 0.0256 -0.3027 -0.3171 -0.2989 0.0074 0.0718 -0.1030 -0.2160 -0.1232 -0.2428 -0.1631 -0.1772 0.0956 0.1220 0.1031 0.0867 0.0998 0.0850 0.0871 0.0312 0.0924 0.0947 0.0973 0.0879 0.0972 0.0977 0.0960 0.0937 0.0803 0.1069 0.1155 0.1337 0.1362 0.1050 0.0917 0.1048 0.1545 0.1543
va: 2.0016 1.9579 3.6521 3.7281 3.9314 3.9233 4.0399 3.9396 3.7623 3.9187 3.9518 3.9358 3.9564 3.3984 3.8228 3.8884 3.8599 3.9109 3.9166 3.9098 1.0140 1.0029 1.0171 1.0130 1.0070 1.0158 1.0164 1.0197 1.0132 1.0070 1.0011 0.9983 1.0046 1.0009 1.0032 1.0167 1.0034 0.9868 0.9929 1.0429 1.0008 0.9948 1.0065 0.9949 0.9919 0.9911
dispcorr: -0.024165261 hartree
energy: -852.144735953692
dipole: 8.70677 -8.55304 0.15373 6.03706 -6.25462 -0.21756 6.64728 -4.95341 1.69387
magnitude: 1.71469 au
magnitude: 4.35840 debye
