program: Orca
programVersion: 5.0.2
elementType: O O C C C C C C C C C C C C C C C C C C H H H H H H H H H H H H H H H H H H H H H H H H H H
charge: 0
multiplicity: 1
keywords: wb97x-d3
keywords: def2-TZVPP
keywords: def2/J RIJCOSX
keywords: DEFGRID2
keywords: scfconv7
keywords: smallprint printgap noloewdin
keywords: NOSOSCF
formula: C18H26O2
InChI: InChI=1/C18H26O2/c1-13(2)18-10-9-17(4,20-18)16(11-18)19-12-15-8-6-5-7-14(15)3/h5-8,13,16H,9-12H2,1-4H3
46 atoms
O  1.931958 0.22898 -0.928306
O  0.03717 -1.85367 -0.253488
C  1.831065 0.942675 0.30416
C  2.284391 -1.048764 -0.405811
C  1.094675 -1.338106 0.526295
C  0.843768 0.068138 1.108826
C  3.227721 0.725949 0.90847
C  3.503426 -0.727639 0.483689
C  1.372825 2.374729 0.071307
C  2.546322 -2.050276 -1.501662
C  1.251367 3.122598 1.394625
C  2.266126 3.142582 -0.897361
C  -1.212762 -1.958803 0.378826
C  -2.206217 -0.923557 -0.093619
C  -3.455844 -0.834221 0.535635
C  -1.911622 -0.075562 -1.155703
C  -4.367855 0.115835 0.086761
C  -3.807533 -1.738706 1.680225
C  -2.832519 0.867652 -1.591814
C  -4.06521 0.966201 -0.96823
H  1.361152 -2.064168 1.304159
H  -0.184007 0.39901 0.950834
H  1.033139 0.107809 2.181212
H  3.242891 0.869911 1.988364
H  3.959253 1.409664 0.475124
H  4.426363 -0.810254 -0.092294
H  3.587458 -1.415673 1.326208
H  0.370862 2.315345 -0.370847
H  2.775254 -3.025417 -1.070641
H  1.694192 -2.170711 -2.169131
H  3.405398 -1.7475 -2.101325
H  0.579944 2.621403 2.093333
H  2.220699 3.233542 1.884874
H  0.855096 4.126115 1.231211
H  3.265662 3.305113 -0.489439
H  1.839632 4.126062 -1.101495
H  2.37542 2.632438 -1.854348
H  -1.111221 -1.911942 1.470407
H  -1.611482 -2.957156 0.161462
H  -0.9469 -0.136795 -1.641165
H  -5.332116 0.192243 0.57553
H  -4.825523 -1.560291 2.024009
H  -3.734557 -2.793028 1.404523
H  -3.143212 -1.590242 2.53464
H  -2.582519 1.522277 -2.41721
H  -4.789994 1.699527 -1.298041
elementType: O C H
totalener: -852.12038859 hartree
nucrepener: 1683.61517821 hartree
electener: -2535.73556680 hartree
oneelecener: -4501.87442171 hartree
twoeener: 1966.13885491 hartree
cpcmener: -0.01908349 hartree
kineticenergy: 848.05899471 hartree
xcener: -85.354673693693 hartree
chargesum: 0.0000000
charge: -0.425446 -0.386785 0.361104 0.314201 0.074341 -0.304044 -0.268891 -0.175012 0.027479 -0.303237 -0.316627 -0.300637 0.006738 0.071292 -0.100698 -0.219059 -0.123682 -0.243637 -0.161483 -0.176674 0.095150 0.122182 0.103783 0.086536 0.099414 0.084853 0.087284 0.029928 0.097401 0.092097 0.094858 0.097349 0.087881 0.097296 0.080118 0.096659 0.094022 0.107261 0.115593 0.133837 0.136276 0.091697 0.105038 0.105210 0.154842 0.154194
qa: -0.4254 -0.3868 0.3611 0.3142 0.0743 -0.3040 -0.2689 -0.1750 0.0275 -0.3032 -0.3166 -0.3006 0.0067 0.0713 -0.1007 -0.2191 -0.1237 -0.2436 -0.1615 -0.1767 0.0951 0.1222 0.1038 0.0865 0.0994 0.0849 0.0873 0.0299 0.0974 0.0921 0.0949 0.0973 0.0879 0.0973 0.0801 0.0967 0.0940 0.1073 0.1156 0.1338 0.1363 0.0917 0.1050 0.1052 0.1548 0.1542
va: 2.0026 1.9581 3.6561 3.7269 3.9351 3.9172 4.0409 3.9367 3.7613 3.9187 3.9516 3.9349 3.9547 3.3990 3.8184 3.8878 3.8609 3.9121 3.9123 3.9106 1.0143 1.0033 1.0173 1.0134 1.0069 1.0158 1.0161 1.0204 1.0011 1.0136 1.0070 1.0010 0.9985 1.0043 1.0031 1.0031 1.0172 0.9872 0.9924 1.0434 1.0008 1.0065 0.9945 0.9949 0.9917 0.9911
dispcorr: -0.024298534 hartree
energy: -852.144687125077
dipole: 8.52192 -8.39771 0.12421 5.95708 -6.18996 -0.23288 6.68024 -4.99744 1.68280
magnitude: 1.70338 au
magnitude: 4.32964 debye
