program: Orca
programVersion: 5.0.2
elementType: O O C C C C C C C C C C C C C C C C C C H H H H H H H H H H H H H H H H H H H H H H H H H H
charge: 0
multiplicity: 1
keywords: wb97x-d3
keywords: def2-TZVPP
keywords: def2/J RIJCOSX
keywords: DEFGRID2
keywords: scfconv7
keywords: smallprint printgap noloewdin
keywords: NOSOSCF
formula: C18H26O2
InChI: InChI=1/C18H26O2/c1-13(2)18-10-9-17(4,20-18)16(11-18)19-12-15-8-6-5-7-14(15)3/h5-8,13,16H,9-12H2,1-4H3
46 atoms
O  2.133306 -0.069628 -1.118588
O  -0.299552 -0.757384 0.427242
C  2.557634 0.961081 -0.226351
C  2.002421 -1.128225 -0.172501
C  1.022186 -0.530519 0.853919
C  1.43168 0.957422 0.824533
C  3.802736 0.330274 0.424292
C  3.39309 -1.151526 0.489036
C  2.804643 2.264266 -0.972546
C  1.585514 -2.418644 -0.829542
C  1.595887 2.739874 -1.772823
C  3.277134 3.351705 -0.012524
C  -1.272441 -0.338506 1.359563
C  -2.631742 -0.67424 0.819099
C  -3.174741 0.037261 -0.261256
C  -3.351596 -1.720324 1.385424
C  -4.431161 -0.330727 -0.734322
C  -2.435098 1.174872 -0.903321
C  -4.604655 -2.075535 0.904944
C  -5.144358 -1.376283 -0.16222
H  1.16824 -0.980256 1.845148
H  0.592202 1.5762 0.499665
H  1.757992 1.331271 1.794886
H  4.024571 0.758181 1.401713
H  4.682811 0.476154 -0.206091
H  4.073061 -1.780926 -0.087673
H  3.36374 -1.55181 1.503218
H  3.618619 2.069635 -1.681389
H  0.651813 -2.32212 -1.382633
H  2.355114 -2.762494 -1.522254
H  1.450239 -3.197344 -0.077741
H  1.249653 1.989938 -2.484238
H  0.753948 3.00412 -1.129345
H  1.852487 3.633682 -2.344476
H  2.508769 3.602195 0.722342
H  3.514195 4.267191 -0.557087
H  4.176213 3.059818 0.532276
H  -1.19523 0.739342 1.555375
H  -1.119031 -0.842069 2.323663
H  -2.922987 -2.267061 2.217472
H  -4.861699 0.214695 -1.566089
H  -1.494753 0.847196 -1.348085
H  -3.031686 1.633548 -1.690847
H  -2.190835 1.956864 -0.180742
H  -5.150413 -2.892241 1.359781
H  -6.12026 -1.638873 -0.550927
elementType: O C H
totalener: -852.12420985 hartree
nucrepener: 1652.60366107 hartree
electener: -2504.72787092 hartree
oneelecener: -4439.87274223 hartree
twoeener: 1935.14487131 hartree
cpcmener: -0.02091989 hartree
kineticenergy: 848.05798077 hartree
xcener: -85.348496628370 hartree
chargesum: 0.0000000
charge: -0.414093 -0.361783 0.355396 0.316436 0.089282 -0.325629 -0.220970 -0.205585 0.033746 -0.301480 -0.307263 -0.315710 0.015351 -0.052666 -0.041442 -0.126910 -0.143718 -0.231491 -0.184478 -0.154281 0.081424 0.101219 0.101591 0.084446 0.090567 0.086234 0.084491 0.035482 0.090501 0.094070 0.096469 0.096100 0.076288 0.099758 0.087458 0.096457 0.096843 0.113429 0.090255 0.136553 0.137002 0.094199 0.096616 0.099391 0.154733 0.155707
qa: -0.4141 -0.3618 0.3554 0.3164 0.0893 -0.3256 -0.2210 -0.2056 0.0337 -0.3015 -0.3073 -0.3157 0.0154 -0.0527 -0.0414 -0.1269 -0.1437 -0.2315 -0.1845 -0.1543 0.0814 0.1012 0.1016 0.0844 0.0906 0.0862 0.0845 0.0355 0.0905 0.0941 0.0965 0.0961 0.0763 0.0998 0.0875 0.0965 0.0968 0.1134 0.0903 0.1366 0.1370 0.0942 0.0966 0.0994 0.1547 0.1557
va: 2.0442 1.9444 3.7139 3.7485 3.9586 3.9984 3.9778 3.9708 3.7286 3.9172 3.9396 3.9526 3.8817 3.6672 3.7206 3.8946 3.8841 3.8735 3.9192 3.9050 1.0158 1.0060 1.0148 1.0120 1.0140 1.0141 1.0159 1.0240 1.0161 1.0077 1.0017 1.0150 1.0012 1.0056 0.9981 1.0045 1.0010 0.9790 1.0061 1.0034 1.0024 1.0172 1.0104 0.9984 0.9926 0.9907
dispcorr: -0.023467106 hartree
energy: -852.147676953016
dipole: 12.86504 -12.33938 0.52567 10.35749 -9.87521 0.48228 -1.00346 2.29863 1.29516
magnitude: 1.47863 au
magnitude: 3.75839 debye
