program: Orca
programVersion: 5.0.2
elementType: O O C C C C C C C C C C C C C C C C C C H H H H H H H H H H H H H H H H H H H H H H H H H H
charge: 0
multiplicity: 1
keywords: wb97x-d3
keywords: def2-TZVPP
keywords: def2/J RIJCOSX
keywords: DEFGRID2
keywords: scfconv7
keywords: smallprint printgap noloewdin
keywords: NOSOSCF
formula: C18H26O2
InChI: InChI=1/C18H26O2/c1-13(2)18-10-9-17(4,20-18)16(11-18)19-12-15-8-6-5-7-14(15)3/h5-8,13,16H,9-12H2,1-4H3
46 atoms
O  2.115069 -0.073506 -1.121995
O  -0.285246 -0.790162 0.441028
C  2.541148 0.957301 -0.230413
C  2.012671 -1.139178 -0.180196
C  1.038013 -0.559685 0.861138
C  1.436571 0.931221 0.843148
C  3.806227 0.339366 0.392293
C  3.412542 -1.14667 0.462734
C  2.753767 2.269847 -0.97083
C  1.604003 -2.431672 -0.838284
C  1.527032 2.725749 -1.75492
C  3.213079 3.360149 -0.007772
C  -1.256144 -0.382001 1.37967
C  -2.617986 -0.682455 0.825159
C  -3.13396 0.049146 -0.255306
C  -3.369289 -1.712216 1.380217
C  -4.396266 -0.282745 -0.73909
C  -2.360813 1.170662 -0.886384
C  -4.628344 -2.030686 0.889456
C  -5.14148 -1.311437 -0.177424
H  1.195426 -1.019132 1.846149
H  0.586256 1.549616 0.547393
H  1.782074 1.293115 1.811408
H  4.043872 0.767997 1.365604
H  4.671335 0.495063 -0.256195
H  4.091786 -1.769485 -0.121781
H  3.400215 -1.546233 1.477559
H  3.563906 2.097923 -1.689816
H  0.664511 -2.343055 -1.382773
H  2.371107 -2.765161 -1.538871
H  1.48369 -3.214142 -0.087843
H  0.680839 2.948656 -1.101765
H  1.752784 3.640432 -2.306371
H  1.201464 1.98244 -2.482741
H  4.122771 3.082973 0.52702
H  2.446472 3.590104 0.735562
H  3.426688 4.283724 -0.548328
H  -1.165445 0.689609 1.603018
H  -1.114608 -0.911402 2.331774
H  -2.96184 -2.273752 2.213018
H  -4.806343 0.278311 -1.570764
H  -1.437884 0.817747 -1.34756
H  -2.949252 1.664034 -1.658984
H  -2.082218 1.93049 -0.152939
H  -5.199471 -2.834041 1.336791
H  -6.121216 -1.545688 -0.574451
elementType: O C H
totalener: -852.12408629 hartree
nucrepener: 1655.19293761 hartree
electener: -2507.31702390 hartree
oneelecener: -4445.05215543 hartree
twoeener: 1937.73513152 hartree
cpcmener: -0.02093812 hartree
kineticenergy: 848.05937518 hartree
xcener: -85.349005728718 hartree
chargesum: -0.0000000
charge: -0.414842 -0.362592 0.356273 0.315484 0.090987 -0.327353 -0.223151 -0.202232 0.035681 -0.301454 -0.309079 -0.316043 0.013903 -0.056504 -0.032932 -0.127406 -0.144808 -0.237068 -0.184001 -0.154775 0.081319 0.101666 0.102168 0.084266 0.090497 0.086188 0.084877 0.035394 0.090633 0.094059 0.096457 0.076327 0.099792 0.096322 0.097009 0.087577 0.096340 0.114579 0.090308 0.136935 0.136527 0.095875 0.096717 0.099326 0.155071 0.155685
qa: -0.4148 -0.3626 0.3563 0.3155 0.0910 -0.3274 -0.2232 -0.2022 0.0357 -0.3015 -0.3091 -0.3160 0.0139 -0.0565 -0.0329 -0.1274 -0.1448 -0.2371 -0.1840 -0.1548 0.0813 0.1017 0.1022 0.0843 0.0905 0.0862 0.0849 0.0354 0.0906 0.0941 0.0965 0.0763 0.0998 0.0963 0.0970 0.0876 0.0963 0.1146 0.0903 0.1369 0.1365 0.0959 0.0967 0.0993 0.1551 0.1557
va: 2.0426 1.9437 3.7099 3.7487 3.9549 4.0004 3.9811 3.9672 3.7266 3.9175 3.9405 3.9530 3.8782 3.6737 3.7037 3.8954 3.8887 3.8729 3.9195 3.9057 1.0156 1.0051 1.0149 1.0122 1.0141 1.0141 1.0157 1.0238 1.0159 1.0076 1.0016 1.0010 1.0062 1.0143 1.0011 0.9979 1.0046 0.9794 1.0063 1.0036 1.0028 1.0171 1.0114 0.9980 0.9925 0.9907
dispcorr: -0.023635564 hartree
energy: -852.147721858229
dipole: 12.80522 -12.25824 0.54698 10.32361 -9.84617 0.47745 -0.97257 2.26753 1.29496
magnitude: 1.48461 au
magnitude: 3.77358 debye
