program: Orca
programVersion: 5.0.2
elementType: O O C C C C C C C C C C C C C C C C C C H H H H H H H H H H H H H H H H H H H H H H H H H H
charge: 0
multiplicity: 1
keywords: wb97x-d3
keywords: def2-TZVPP
keywords: def2/J RIJCOSX
keywords: DEFGRID2
keywords: scfconv7
keywords: smallprint printgap noloewdin
keywords: NOSOSCF
formula: C18H26O2
InChI: InChI=1/C18H26O2/c1-13(2)18-10-9-17(4,20-18)16(11-18)19-12-15-8-6-5-7-14(15)3/h5-8,13,16H,9-12H2,1-4H3
46 atoms
O  1.89998 0.250037 -1.019135
O  -0.882453 1.037901 -0.305516
C  2.489939 1.085583 -0.035611
C  1.032119 -0.496994 -0.181215
C  0.194249 0.611564 0.494634
C  1.251886 1.726146 0.625206
C  3.066019 0.062037 0.963361
C  1.999569 -1.046335 0.891525
C  3.457898 2.072957 -0.670127
C  0.274654 -1.545728 -0.951351
C  4.082587 2.976334 0.388967
C  4.534701 1.393805 -1.509763
C  -2.140335 1.051995 0.325211
C  -2.752388 -0.318556 0.454128
C  -3.252808 -0.9871 -0.671551
C  -2.782915 -0.947841 1.692139
C  -3.757816 -2.272095 -0.512801
C  -3.260604 -0.33713 -2.025401
C  -3.289111 -2.231891 1.838639
C  -3.776039 -2.896536 0.726956
H  -0.169207 0.26937 1.470723
H  0.924572 2.602636 0.061892
H  1.426996 2.037195 1.656128
H  3.191382 0.477285 1.963956
H  4.039959 -0.308206 0.640467
H  2.429826 -1.992375 0.559872
H  1.504782 -1.238536 1.845352
H  2.861819 2.702126 -1.341752
H  0.965423 -2.270246 -1.384502
H  -0.40919 -2.082845 -0.293431
H  -0.309404 -1.107777 -1.75804
H  4.703265 2.407121 1.084398
H  4.723825 3.726277 -0.075938
H  3.331304 3.509792 0.973226
H  5.148292 2.142566 -2.013516
H  4.103138 0.747908 -2.272771
H  5.206031 0.788857 -0.897014
H  -2.775288 1.700251 -0.283641
H  -2.079566 1.519239 1.317971
H  -2.405057 -0.420734 2.561289
H  -4.147166 -2.795966 -1.377776
H  -3.941958 0.516544 -2.053978
H  -2.275349 0.034544 -2.304354
H  -3.586774 -1.035789 -2.794703
H  -3.302133 -2.705285 2.811669
H  -4.17413 -3.898753 0.819885
totalener: -852.10119037 hartree
nucrepener: 1671.10794019 hartree
electener: -2523.20913056 hartree
oneelecener: -4476.05982301 hartree
twoeener: 1952.85069245 hartree
kineticenergy: 848.08774219 hartree
xcener: -85.352265177416 hartree
chargesum: -0.0000000
charge: -0.360279 -0.337175 0.350072 0.425807 0.046951 -0.256087 -0.256473 -0.227453 -0.003956 -0.338222 -0.293496 -0.276234 0.014060 0.025152 -0.080820 -0.122472 -0.090189 -0.246635 -0.150312 -0.124885 0.050962 0.086890 0.083213 0.078389 0.094747 0.078402 0.076342 0.034201 0.090558 0.084605 0.105267 0.078637 0.089636 0.088967 0.083816 0.106695 0.064269 0.098444 0.082816 0.110638 0.104352 0.097291 0.106821 0.079196 0.123259 0.124232
qa: -0.3603 -0.3372 0.3501 0.4258 0.0470 -0.2561 -0.2565 -0.2275 -0.0040 -0.3382 -0.2935 -0.2762 0.0141 0.0252 -0.0808 -0.1225 -0.0902 -0.2466 -0.1503 -0.1249 0.0510 0.0869 0.0832 0.0784 0.0947 0.0784 0.0763 0.0342 0.0906 0.0846 0.1053 0.0786 0.0896 0.0890 0.0838 0.1067 0.0643 0.0984 0.0828 0.1106 0.1044 0.0973 0.1068 0.0792 0.1233 0.1242
va: 2.0980 1.9622 3.7310 3.5869 4.0508 4.0431 3.9985 3.9800 3.7798 3.9471 3.9472 3.9439 3.9364 3.4839 3.8201 3.9049 3.9233 3.9180 3.9997 3.9755 1.0166 1.0410 1.0128 1.0164 1.0114 1.0176 1.0136 1.0235 1.0141 0.9966 1.0079 1.0003 1.0077 1.0045 1.0053 1.0172 1.0072 0.9931 0.9938 1.0077 1.0082 0.9961 1.0079 1.0079 1.0018 0.9998
dispcorr: -0.024774554 hartree
energy: -852.125964926755
dipole: 14.09045 -14.29176 -0.20131 4.94801 -5.00832 -0.06031 -1.02371 1.72650 0.70279
magnitude: 0.73354 au
magnitude: 1.86450 debye
