program: Orca
programVersion: 5.0.2
elementType: O O C C C C C C C C C C C C C C C C C C H H H H H H H H H H H H H H H H H H H H H H H H H H
charge: 0
multiplicity: 1
keywords: wb97x-d3
keywords: def2-TZVPP
keywords: def2/J RIJCOSX
keywords: DEFGRID2
keywords: scfconv7
keywords: smallprint printgap noloewdin
keywords: NOSOSCF
formula: C18H26O2
InChI: InChI=1/C18H26O2/c1-13(2)18-10-9-17(4,20-18)16(11-18)19-12-15-8-6-5-7-14(15)3/h5-8,13,16H,9-12H2,1-4H3
46 atoms
O  1.94367 0.130085 -0.90597
O  -0.919741 1.046946 -0.499682
C  2.463089 1.114114 -0.024389
C  0.988161 -0.460426 -0.03812
C  0.126844 0.751237 0.393588
C  1.185535 1.871665 0.38321
C  2.912824 0.273397 1.188484
C  1.853489 -0.84367 1.180973
C  3.519206 1.962661 -0.716451
C  0.274986 -1.609807 -0.69815
C  4.072514 3.02377 0.230836
C  4.649316 1.133432 -1.318291
C  -2.211163 1.063535 0.060538
C  -2.762486 -0.314293 0.317783
C  -3.20347 -1.118458 -0.741692
C  -2.78038 -0.819368 1.611673
C  -3.635166 -2.409303 -0.463196
C  -3.215702 -0.608999 -2.154186
C  -3.210546 -2.111417 1.877675
C  -3.635909 -2.910475 0.831094
H  -0.273825 0.581765 1.399814
H  0.920754 2.609933 -0.376699
H  1.2725 2.39012 1.33897
H  2.924701 0.851199 2.113362
H  3.915552 -0.131308 1.047001
H  2.309914 -1.821451 1.020433
H  1.276588 -0.90772 2.105082
H  3.011986 2.478165 -1.540573
H  0.991189 -2.380614 -0.985237
H  -0.446054 -2.056932 -0.0138
H  -0.259768 -1.292234 -1.590943
H  4.59536 2.572002 1.076426
H  4.788645 3.663585 -0.286311
H  3.289785 3.670578 0.629311
H  5.32506 1.775491 -1.885333
H  4.27235 0.36745 -1.993634
H  5.247111 0.640287 -0.5495
H  -2.840308 1.604779 -0.649833
H  -2.226587 1.641681 0.994854
H  -2.451272 -0.18812 2.429576
H  -3.976253 -3.038351 -1.276717
H  -3.483187 -1.39941 -2.85407
H  -3.942962 0.196181 -2.282525
H  -2.24527 -0.212237 -2.451655
H  -3.212453 -2.487227 2.892269
H  -3.973169 -3.92177 1.017296
totalener: -852.10103359 hartree
nucrepener: 1674.66263024 hartree
electener: -2526.76366383 hartree
oneelecener: -4483.15894018 hartree
twoeener: 1956.39527634 hartree
kineticenergy: 848.09767501 hartree
xcener: -85.354621422953 hartree
chargesum: -0.0000000
charge: -0.360364 -0.337061 0.347779 0.436189 0.047839 -0.259523 -0.247136 -0.240028 -0.005661 -0.335295 -0.293412 -0.275301 0.009058 0.039217 -0.079453 -0.137086 -0.090067 -0.245660 -0.143744 -0.128081 0.050892 0.085999 0.081109 0.079436 0.095557 0.078032 0.075351 0.034449 0.091151 0.083292 0.104381 0.078771 0.089119 0.088891 0.083595 0.105707 0.064925 0.098858 0.083809 0.109914 0.104623 0.078703 0.097892 0.105562 0.123600 0.124172
qa: -0.3604 -0.3371 0.3478 0.4362 0.0478 -0.2595 -0.2471 -0.2400 -0.0057 -0.3353 -0.2934 -0.2753 0.0091 0.0392 -0.0795 -0.1371 -0.0901 -0.2457 -0.1437 -0.1281 0.0509 0.0860 0.0811 0.0794 0.0956 0.0780 0.0754 0.0344 0.0912 0.0833 0.1044 0.0788 0.0891 0.0889 0.0836 0.1057 0.0649 0.0989 0.0838 0.1099 0.1046 0.0787 0.0979 0.1056 0.1236 0.1242
va: 2.0985 1.9633 3.7326 3.5683 4.0284 4.0572 3.9858 3.9956 3.7831 3.9508 3.9471 3.9436 3.9423 3.4576 3.8183 3.9130 3.9231 3.9202 3.9910 3.9792 1.0155 1.0426 1.0141 1.0155 1.0111 1.0177 1.0135 1.0232 1.0149 0.9957 1.0087 1.0006 1.0077 1.0047 1.0051 1.0179 1.0072 0.9940 0.9941 1.0088 1.0083 1.0081 0.9960 1.0070 1.0018 1.0001
dispcorr: -0.025006293 hartree
energy: -852.126039887186
dipole: 13.91206 -14.17876 -0.26670 4.90961 -4.88268 0.02693 -0.64372 1.32529 0.68158
magnitude: 0.73240 au
magnitude: 1.86160 debye
