program: Orca
programVersion: 5.0.2
elementType: O O C C C C C C C C C C C C C C C C C C H H H H H H H H H H H H H H H H H H H H H H H H H H
charge: 0
multiplicity: 1
keywords: wb97x-d3
keywords: def2-TZVPP
keywords: def2/J RIJCOSX
keywords: DEFGRID2
keywords: scfconv7
keywords: smallprint printgap noloewdin
keywords: NOSOSCF
formula: C18H26O2
InChI: InChI=1/C18H26O2/c1-13(2)18-10-9-17(4,20-18)16(11-18)19-12-15-8-6-5-7-14(15)3/h5-8,13,16H,9-12H2,1-4H3
46 atoms
O  2.219042 0.160635 -0.847492
O  -0.065128 -1.702067 -0.604959
C  1.78869 1.029728 0.189636
C  2.2050 -1.061482 -0.130445
C  0.752721 -1.131068 0.383398
C  0.472505 0.364868 0.648035
C  2.826905 0.759213 1.299622
C  3.097291 -0.741403 1.088248
C  1.689415 2.470399 -0.307157
C  2.669274 -2.21474 -0.981858
C  3.002032 2.959303 -0.920541
C  0.557996 2.678002 -1.314766
C  -1.287835 -2.217834 -0.148213
C  -2.279149 -1.174419 0.301194
C  -2.821435 -0.256266 -0.609502
C  -2.641767 -1.106139 1.639381
C  -3.709598 0.702131 -0.135942
C  -2.445897 -0.280665 -2.062864
C  -3.531832 -0.146276 2.099466
C  -4.064855 0.764008 1.204524
H  0.692803 -1.732048 1.302283
H  -0.371198 0.692695 0.04645
H  0.225413 0.580296 1.688217
H  2.438526 0.997007 2.290475
H  3.735258 1.344412 1.159806
H  4.144281 -0.926434 0.843687
H  2.858331 -1.356398 1.957473
H  1.475959 3.085289 0.575258
H  2.044753 -2.341601 -1.863268
H  3.69832 -2.057328 -1.30596
H  2.637865 -3.142669 -0.40987
H  3.25439 2.389414 -1.814249
H  2.914463 4.007371 -1.209246
H  3.843351 2.887745 -0.232535
H  -0.4296 2.529072 -0.879835
H  0.659816 1.999079 -2.162012
H  0.582269 3.696648 -1.703816
H  -1.123511 -2.930944 0.673315
H  -1.697169 -2.79176 -0.98402
H  -2.215803 -1.818306 2.337126
H  -4.13485 1.415931 -0.831444
H  -2.617016 -1.26162 -2.50921
H  -3.03131 0.441463 -2.629703
H  -1.390932 -0.05079 -2.210029
H  -3.801921 -0.110182 3.146544
H  -4.759012 1.521701 1.54389
totalener: -852.10003602 hartree
nucrepener: 1703.95234894 hartree
electener: -2556.05238497 hartree
oneelecener: -4541.79148748 hartree
twoeener: 1985.73910251 hartree
kineticenergy: 848.10074807 hartree
xcener: -85.356987452671 hartree
chargesum: -0.0000000
charge: -0.371300 -0.328606 0.342184 0.326385 0.060640 -0.235140 -0.241872 -0.204352 0.057214 -0.279881 -0.277267 -0.300949 -0.007552 -0.007197 -0.068084 -0.096606 -0.114264 -0.214998 -0.156430 -0.109456 0.053417 0.049840 0.087838 0.076118 0.090344 0.080115 0.071770 0.031474 0.096611 0.084752 0.076719 0.095426 0.080571 0.075450 0.078388 0.099296 0.084953 0.080659 0.103211 0.103298 0.105468 0.092058 0.078983 0.103031 0.123503 0.124239
qa: -0.3713 -0.3286 0.3422 0.3264 0.0606 -0.2351 -0.2419 -0.2044 0.0572 -0.2799 -0.2773 -0.3009 -0.0076 -0.0072 -0.0681 -0.0966 -0.1143 -0.2150 -0.1564 -0.1095 0.0534 0.0498 0.0878 0.0761 0.0903 0.0801 0.0718 0.0315 0.0966 0.0848 0.0767 0.0954 0.0806 0.0755 0.0784 0.0993 0.0850 0.0807 0.1032 0.1033 0.1055 0.0921 0.0790 0.1030 0.1235 0.1242
va: 2.0952 1.9604 3.7360 3.7933 3.9843 4.0069 3.9936 3.9507 3.7277 3.9200 3.9503 3.9512 3.9486 3.5227 3.8056 3.8914 3.9222 3.9250 3.9966 3.9573 1.0188 1.0561 1.0239 1.0199 1.0175 1.0156 1.0194 1.0174 1.0211 1.0100 1.0047 1.0110 1.0058 1.0114 1.0030 1.0101 1.0101 1.0014 0.9940 1.0099 1.0084 1.0031 1.0069 1.0102 1.0014 0.9991
dispcorr: -0.025491364 hartree
energy: -852.125527388238
dipole: 9.11571 -9.34936 -0.23365 6.67530 -6.71317 -0.03787 -3.04889 3.75299 0.70410
magnitude: 0.74282 au
magnitude: 1.88809 debye
