program: Gaussian 09
title: 000059797
version: EM64L-G09RevD.01
frameworkgroup: C1[X(C24H29N3O)]
method: RPBEPBE
basis: SDD
operation: Freq
keyword: #p
keyword: freq=noraman
keyword: PBEPBE/SDD
title: #p freq=noraman PBEPBE/SDD
converged: YES YES NO NO
title: Mulliken charges:
elementType: O N N N C C C C C C C C C C C C C C C C C C C C C C C C H H H H H H H H H H H H H H H H H H H H H H H H H H H H H
charge: -0.275146 -0.128850 -0.134470 -0.094778 0.020623 -0.349746 -0.358909 -0.447751 -0.453686 -0.460277 -0.765381 -0.426960 -0.585565 0.366346 0.516477 -0.520892 0.118055 -0.418391 -0.369752 0.338386 -0.227283 -0.231474 -0.239387 -0.358169 -0.356421 -0.249126 -0.234257 -0.238929 0.193158 0.226611 0.176699 0.205557 0.190353 0.227438 0.209474 0.210330 0.223657 0.234390 0.221740 0.235181 0.229518 0.214187 0.236507 0.275327 0.264629 0.209175 0.245503 0.218707 0.263590 0.224725 0.228474 0.229156 0.220349 0.271688 0.224404 0.227118 0.228073
chargesum: 0.00000
title: Mulliken charges with hydrogens summed into heavy atoms:
elementType: O N N N C C C C C C C C C C C C C C C C C C C C C C C C
charge: -0.275146 -0.128850 -0.134470 -0.094778 0.213781 0.053564 0.037001 -0.010840 -0.019700 -0.004147 -0.086495 0.084874 -0.111760 0.366346 0.516477 -0.275389 0.118055 -0.199684 -0.106162 0.338386 -0.002558 -0.003001 -0.010231 -0.137820 -0.084733 -0.024723 -0.007139 -0.010856
polarizability: 4.12691016e+02 -2.59693397e+01 2.68896104e+02 3.85067500e+00 -7.59172548e+00 1.89423336e+02
1716.lowfreq: -29.2570 -9.0168 -5.3247 -0.0006 -0.0004 0.0008 2.4942 5.1758 10.2093
frequency: -29.1616 -6.3841 9.7594 15.4140 20.5188 27.0804 31.8687 50.5750 54.4057 77.0479 87.6582 105.2712 135.9601 141.6029 151.3654 187.0728 205.2840 218.6604 226.6604 248.9094 254.0922 310.4962 318.2656 339.7410 351.1845 372.0753 396.1503 399.0092 403.1576 423.0966 439.8900 470.5690 488.9201 501.8512 559.4952 572.1025 614.8219 615.6499 617.4579 629.0923 636.6689 650.8061 670.9199 689.8850 697.0355 706.5921 734.6835 743.4404 756.0492 784.0232 785.1213 808.6198 817.7006 832.2843 851.9336 853.5018 857.1375 887.2770 889.2118 906.4794 923.1558 923.8796 929.2135 948.9078 956.1769 967.9978 970.4161 976.2672 979.5024 980.1815 989.7858 990.1365 998.7660 1000.3152 1002.6577 1024.6450 1026.3225 1030.9064 1064.4951 1078.4794 1085.7273 1085.8983 1088.3504 1103.5762 1106.3383 1121.5049 1165.4302 1171.9006 1172.8097 1173.6837 1189.8262 1191.0377 1191.4569 1194.8541 1201.2763 1207.4632 1221.0758 1226.8428 1240.0744 1262.9239 1276.1383 1285.5972 1287.5392 1292.0302 1311.2753 1317.8236 1321.6814 1324.9877 1336.9435 1342.0727 1357.8448 1362.2235 1369.9562 1374.7213 1384.6540 1389.1843 1406.5346 1433.4668 1441.9421 1455.7527 1464.0497 1465.0770 1469.6509 1475.3986 1477.6385 1481.7695 1484.2009 1490.8222 1491.5267 1498.0430 1512.7513 1588.3823 1594.4009 1613.0420 1618.2847 1631.7385 2803.5588 2833.4049 2848.0845 2985.2015 2988.2841 2993.4656 3007.3914 3008.5353 3020.4510 3031.4270 3040.5984 3054.8628 3065.6278 3071.0705 3074.1322 3081.1586 3087.0553 3090.4480 3107.2039 3124.2631 3124.9791 3133.8496 3135.1305 3146.4801 3146.6274 3157.1721 3163.3452 3168.1529 3248.2836
redmass: 1.7796 3.6995 4.7910 4.3773 4.1876 4.0781 4.8749 5.1709 4.2485 2.6991 4.5721 4.2944 3.4644 2.7337 3.3883 4.3748 4.1780 2.0973 3.3286 2.1750 1.9328 4.0939 2.8700 3.8430 2.3143 5.4577 2.5503 2.7968 2.8069 3.8657 3.1438 3.9321 3.9086 3.7794 3.7924 3.4687 6.2091 6.3938 6.7896 3.7700 2.9902 3.8875 1.8021 4.9050 2.1414 1.7124 1.4375 1.6368 2.0306 1.4645 1.9577 3.3327 11.9719 2.2736 1.2550 1.4565 1.2553 2.8109 4.2742 2.8422 1.8138 4.8707 1.4533 2.2262 1.7865 1.8363 1.5494 2.0752 1.4211 1.3792 6.1381 6.2238 1.3255 1.3293 2.0197 2.4600 2.2476 2.2530 1.9191 2.2017 1.6976 1.7290 1.6182 2.1813 2.7644 2.9455 1.9590 1.5208 1.0599 1.3018 1.1288 1.2353 1.2344 1.3270 1.6895 2.0640 1.8543 1.7144 1.2116 1.6208 1.4641 1.2573 1.3871 1.3538 1.5683 1.3669 1.4592 1.3290 1.5453 1.5155 1.4057 1.5219 1.4137 4.0766 7.2520 1.2281 4.4015 2.8381 2.1622 2.8602 1.0961 1.1065 1.1011 1.1139 1.0917 1.0910 1.8836 1.0778 1.0863 1.1023 3.5317 6.2374 6.0814 6.0032 6.0322 7.3933 1.0811 1.0716 1.0715 1.0376 1.0653 1.0603 1.0613 1.0610 1.0697 1.0798 1.0978 1.0908 1.1027 1.1005 1.1006 1.0991 1.0994 1.1051 1.0881 1.0846 1.0860 1.0880 1.0912 1.0930 1.0960 1.0964 1.1014 1.1008 1.0977
irintensity: 0.0080 0.0649 0.0475 0.0854 0.0346 0.4648 1.4638 3.1549 0.1133 0.6486 0.5077 2.2529 1.2700 1.2906 1.2835 0.1019 0.0942 1.4855 1.7254 0.5439 0.4372 0.7341 4.6599 1.3303 0.2462 13.4888 2.1172 0.0372 0.1043 1.7343 2.4861 10.0302 4.0707 1.5968 6.6915 2.0320 4.8797 1.0531 0.4805 11.7920 0.1340 11.6464 5.2674 10.7006 27.3006 60.9373 1.9830 113.8953 38.0029 9.4412 13.2407 9.4400 17.6525 5.4261 0.0258 2.6686 0.5340 23.6852 31.7920 6.0409 3.1802 8.5713 4.1716 8.6180 8.3835 1.3502 2.7880 4.3017 0.5864 0.1809 0.1724 0.2616 0.9466 0.4390 21.1724 7.1692 4.4615 17.5544 3.3414 1.8763 2.5286 28.1840 10.9544 17.1711 7.3898 5.0939 14.6482 18.0732 0.4076 14.6838 0.6278 6.0429 3.6673 10.6695 24.0826 16.1250 35.1295 4.5415 5.6837 7.1914 34.1407 2.0273 12.2586 2.7370 19.5739 2.9756 9.8654 30.7821 4.1508 20.6158 4.9084 8.5744 1.9305 15.9779 6.4677 20.9194 55.1971 38.5557 27.0979 82.5908 7.0336 5.1210 14.0967 27.5706 10.8820 6.7739 7.8499 11.8829 14.0565 0.5971 1.8585 16.5262 1.9315 1.2330 1.1329 903.4723 69.0689 64.2058 191.8452 14.7445 57.3259 15.2772 24.9310 11.5343 94.7260 40.1367 28.9543 17.5210 3.2791 19.2908 9.5159 38.6948 49.0379 76.6089 17.6898 1.9922 0.2287 6.3669 13.3114 41.0338 26.4853 22.3665 27.3030 19.1360 5.3962
temp: 298.150 k
press: 1.00000 atm
elementType: 8 7 7 7 6 6 6 6 6 6 6 6 6 6 6 6 6 6 6 6 6 6 6 6 6 6 6 6 1 1 1 1 1 1 1 1 1 1 1 1 1 1 1 1 1 1 1 1 1 1 1 1 1 1 1 1 1
symmnumber: 1
zpe: 1255871.1 jmol-1
zpe.correction: 0.478336 hartree
zpe.thermalcorrener: 0.502921 hartree
zpe.thermalcorrenthalpy: 0.503865 hartree
zpe.thermalcorrgfe: 0.419209 hartree
zpe.sumelectzpe: -1169.315680 hartree
zpe.sumelectthermal: -1169.291096 hartree
zpe.sumelectthermalent: -1169.290152 hartree
zpe.sumelectthermalfe: -1169.374808 hartree
dipole: -4.4956 -3.3553 1.0801
dipole: 5.7127
quadrupole: -152.5295 -159.7602 -169.5666
quadrupole: -4.4159 7.1889 2.3941
quadrupole: 8.0893 0.8586 -8.9478 -4.4159 7.1889 2.3941
hfenergy: -1169.7940165 hartree
pointgroup: C01 [X(C24H29N3O1)]
dipole: 1.8465885 -1.1923004 -0.4690556 debye
polarizability: 408.3346767|36.0385116|273.3015319|-2.1620202|6.836976|189.3742482 unknown
InChI: InChI=1S/C24H29N3O/c1-20(26-15-8-9-16-26)14-17-27(19-21-10-4-2-5-11-21)24-18-23(25-28-24)22-12-6-3-7-13-22/h2-7,10-13,18,20H,8-9,14-17,19H2,1H3
charge 0 multiplicity 1
57 atoms
O  -1.769543 1.350945 1.196834
N  3.800937 -2.005834 -0.16299
N  0.326769 0.429375 0.587325
N  -3.217628 1.031532 1.079245
C  2.548684 -2.744855 0.159089
C  4.865236 -2.822006 -0.813467
C  4.476705 -1.385433 1.011037
C  6.127827 -1.926057 -0.739648
C  5.867975 -0.968611 0.470915
C  1.499854 -1.791068 0.791745
C  1.983105 -3.446068 -1.097366
C  1.147425 -0.581949 -0.110271
C  1.012293 1.552863 1.272845
C  -1.036879 0.314396 0.593208
C  1.534888 2.619802 0.312348
C  -1.922392 -0.645032 0.092972
C  -3.236492 -0.159467 0.413152
C  2.925544 2.786912 0.102572
C  0.626741 3.458503 -0.384997
C  -4.537594 -0.796796 0.112483
C  3.407187 3.774495 -0.78851
C  1.104725 4.443994 -1.27491
C  2.496719 4.605204 -1.479451
C  -4.598871 -2.02611 -0.595716
C  -5.751732 -0.184212 0.529821
C  -5.842579 -2.630551 -0.879484
C  -6.992095 -0.788854 0.244683
C  -7.044656 -2.015357 -0.460953
H  2.767667 -3.540512 0.923431
H  4.589054 -3.077939 -1.849972
H  5.037226 -3.780469 -0.257386
H  3.900492 -0.524492 1.394319
H  4.585981 -2.119261 1.851588
H  6.242596 -1.344585 -1.670132
H  7.04114 -2.532042 -0.60883
H  6.642541 -1.054976 1.252658
H  5.851232 0.081585 0.1312
H  0.586345 -2.372808 1.01946
H  1.875746 -1.412893 1.761749
H  1.880691 -2.733091 -1.934949
H  2.633514 -4.272758 -1.431537
H  0.988836 -3.874901 -0.8756
H  0.610776 -0.911707 -1.01817
H  2.080014 -0.100692 -0.454014
H  0.295365 1.995584 1.984945
H  1.853403 1.134453 1.859728
H  -1.668269 -1.57037 -0.413896
H  3.635737 2.145841 0.642103
H  -0.45078 3.336208 -0.222797
H  4.485569 3.895447 -0.94171
H  0.395694 5.089565 -1.805261
H  2.866167 5.372579 -2.169037
H  -3.675777 -2.512815 -0.928906
H  -5.703417 0.763493 1.075613
H  -5.873727 -3.579275 -1.426968
H  -7.919447 -0.305704 0.572132
H  -8.010021 -2.484426 -0.681574
