program: Orca
programVersion: 5.0.2
elementType: O O C C C C C C C C C C C C C C C C C C H H H H H H H H H H H H H H H H H H H H H H H H H H
charge: 0
multiplicity: 1
keywords: wb97x-d3
keywords: def2-TZVPP
keywords: def2/J RIJCOSX
keywords: DEFGRID2
keywords: scfconv7
keywords: smallprint printgap noloewdin
keywords: NOSOSCF
formula: C18H26O2
InChI: InChI=1/C18H26O2/c1-13(2)18-10-9-17(4,20-18)16(11-18)19-12-15-8-6-5-7-14(15)3/h5-8,13,16H,9-12H2,1-4H3
46 atoms
O  2.181627 0.171452 -0.879483
O  -0.063559 -1.735266 -0.551527
C  1.784891 1.024395 0.184026
C  2.213064 -1.058112 -0.175337
C  0.785406 -1.151414 0.401727
C  0.495107 0.339667 0.684681
C  2.868846 0.753552 1.249452
C  3.154957 -0.738993 1.005104
C  1.652985 2.469776 -0.29066
C  2.653501 -2.195936 -1.059498
C  2.930148 2.9697 -0.966673
C  0.468497 2.684803 -1.233351
C  -1.277082 -2.23464 -0.055917
C  -2.272138 -1.176523 0.34928
C  -2.792355 -0.277662 -0.593104
C  -2.665314 -1.07935 1.677026
C  -3.688179 0.692707 -0.15956
C  -2.384181 -0.330146 -2.036894
C  -3.5639 -0.108906 2.096364
C  -4.07357 0.784115 1.170827
H  0.774482 -1.755141 1.320963
H  -0.37211 0.66106 0.114056
H  0.281072 0.546422 1.733973
H  2.513742 0.969683 2.257686
H  3.76175 1.356442 1.086758
H  4.192465 -0.901884 0.70938
H  2.967563 -1.369578 1.87577
H  1.484398 3.073859 0.608889
H  3.66365 -2.018719 -1.42982
H  2.663609 -3.130103 -0.496959
H  1.990275 -2.323757 -1.912028
H  3.809551 2.878906 -0.330308
H  3.12831 2.420115 -1.88651
H  2.830306 4.024587 -1.225067
H  -0.494247 2.534149 -0.745742
H  0.522548 2.01127 -2.089758
H  0.473024 3.705971 -1.616897
H  -1.099371 -2.904057 0.798971
H  -1.691782 -2.853403 -0.856721
H  -2.256794 -1.776793 2.399603
H  -4.095345 1.392524 -0.87975
H  -1.33835 -0.052464 -2.169968
H  -2.496325 -1.331568 -2.455642
H  -2.991621 0.345137 -2.637727
H  -3.858257 -0.050982 3.135923
H  -4.77302 1.550645 1.478045
totalener: -852.09992202 hartree
nucrepener: 1705.15969376 hartree
electener: -2557.25961578 hartree
oneelecener: -4544.20913502 hartree
twoeener: 1986.94951924 hartree
kineticenergy: 848.09768601 hartree
xcener: -85.356463709931 hartree
chargesum: -0.0000000
charge: -0.371257 -0.326640 0.341683 0.323290 0.064448 -0.238422 -0.241449 -0.204515 0.058810 -0.280309 -0.276823 -0.303483 -0.008404 -0.009894 -0.063091 -0.101762 -0.119473 -0.208965 -0.150762 -0.110197 0.053548 0.052392 0.086725 0.076079 0.090097 0.080112 0.072083 0.031818 0.084786 0.076961 0.096811 0.075992 0.094853 0.080717 0.079194 0.098272 0.085710 0.079303 0.104641 0.103222 0.105293 0.100627 0.091415 0.079070 0.123368 0.124124
qa: -0.3713 -0.3266 0.3417 0.3233 0.0644 -0.2384 -0.2414 -0.2045 0.0588 -0.2803 -0.2768 -0.3035 -0.0084 -0.0099 -0.0631 -0.1018 -0.1195 -0.2090 -0.1508 -0.1102 0.0535 0.0524 0.0867 0.0761 0.0901 0.0801 0.0721 0.0318 0.0848 0.0770 0.0968 0.0760 0.0949 0.0807 0.0792 0.0983 0.0857 0.0793 0.1046 0.1032 0.1053 0.1006 0.0914 0.0791 0.1234 0.1241
va: 2.0932 1.9610 3.7307 3.7930 3.9810 4.0088 3.9935 3.9516 3.7243 3.9217 3.9520 3.9522 3.9475 3.5263 3.8054 3.8988 3.9193 3.9297 3.9925 3.9572 1.0194 1.0557 1.0248 1.0198 1.0175 1.0158 1.0196 1.0173 1.0100 1.0048 1.0207 1.0116 1.0107 1.0056 1.0028 1.0091 1.0103 1.0022 0.9926 1.0100 1.0086 1.0106 1.0040 1.0065 1.0013 0.9991
dispcorr: -0.025581319 hartree
energy: -852.125503336370
dipole: 9.11694 -9.30662 -0.18968 6.68350 -6.72409 -0.04059 -3.11207 3.82122 0.70915
magnitude: 0.73521 au
magnitude: 1.86875 debye
