program: Orca
programVersion: 5.0.2
elementType: O O C C C C C C C C C C C C C C C C C C H H H H H H H H H H H H H H H H H H H H H H H H H H
charge: 0
multiplicity: 1
keywords: wb97x-d3
keywords: def2-TZVPP
keywords: def2/J RIJCOSX
keywords: DEFGRID2
keywords: scfconv7
keywords: smallprint printgap noloewdin
keywords: NOSOSCF
formula: C18H26O2
InChI: InChI=1/C18H26O2/c1-13(2)18-10-9-17(4,20-18)16(11-18)19-12-15-8-6-5-7-14(15)3/h5-8,13,16H,9-12H2,1-4H3
46 atoms
O  2.088624 -0.019177 -0.881542
O  -0.769183 0.923172 -0.601939
C  2.579276 0.938351 0.044772
C  1.082692 -0.609978 -0.073515
C  0.224244 0.606655 0.344301
C  1.299011 1.710654 0.417008
C  2.960408 0.056813 1.252394
C  1.881551 -1.037498 1.175724
C  3.724896 1.741331 -0.553976
C  0.369525 -1.725214 -0.789791
C  3.352423 2.436022 -1.860022
C  4.271827 2.746762 0.45564
C  -2.071657 1.066243 -0.084251
C  -2.707311 -0.248934 0.286396
C  -3.15869 -1.132203 -0.703506
C  -2.799479 -0.618013 1.622754
C  -3.673599 -2.362968 -0.31424
C  -3.110759 -0.764045 -2.158552
C  -3.314125 -1.85007 1.999696
C  -3.748881 -2.728119 1.022632
H  -0.231599 0.418441 1.322515
H  1.069804 2.479342 -0.322178
H  1.358035 2.192941 1.393721
H  2.953338 0.60504 2.195023
H  3.962249 -0.358503 1.123597
H  2.32365 -2.022455 1.01929
H  1.260164 -1.104199 2.070356
H  4.521092 1.020905 -0.776439
H  -0.416033 -2.139731 -0.157466
H  -0.089911 -1.378978 -1.713306
H  1.066518 -2.527588 -1.03388
H  2.603661 3.215413 -1.707101
H  4.230565 2.91759 -2.293215
H  2.960043 1.733776 -2.593319
H  5.132722 3.274511 0.043529
H  4.596869 2.269169 1.380728
H  3.524178 3.499759 0.713386
H  -2.649855 1.568613 -0.862963
H  -2.077512 1.733242 0.788879
H  -2.464089 0.075229 2.386089
H  -4.023168 -3.052115 -1.073732
H  -3.354021 -1.619145 -2.787601
H  -3.83169 0.023073 -2.391657
H  -2.129113 -0.398057 -2.455964
H  -3.373639 -2.118713 3.046098
H  -4.150992 -3.69494 1.296074
totalener: -852.10122140 hartree
nucrepener: 1676.73649613 hartree
electener: -2528.83771752 hartree
oneelecener: -4487.30825887 hartree
twoeener: 1958.47054134 hartree
kineticenergy: 848.09413182 hartree
xcener: -85.354048702345 hartree
chargesum: -0.0000000
charge: -0.359725 -0.338270 0.357315 0.434536 0.050611 -0.301870 -0.216725 -0.246925 -0.008521 -0.338138 -0.271839 -0.293069 0.020094 0.036558 -0.090022 -0.133291 -0.083898 -0.256995 -0.148786 -0.125651 0.057397 0.095649 0.085491 0.074293 0.086925 0.078869 0.076127 0.031907 0.084707 0.104232 0.090859 0.066277 0.082858 0.107057 0.089168 0.088883 0.079120 0.098625 0.084381 0.112779 0.104496 0.079953 0.100388 0.105723 0.123906 0.124538
qa: -0.3597 -0.3383 0.3573 0.4345 0.0506 -0.3019 -0.2167 -0.2469 -0.0085 -0.3381 -0.2718 -0.2931 0.0201 0.0366 -0.0900 -0.1333 -0.0839 -0.2570 -0.1488 -0.1257 0.0574 0.0956 0.0855 0.0743 0.0869 0.0789 0.0761 0.0319 0.0847 0.1042 0.0909 0.0663 0.0829 0.1071 0.0892 0.0889 0.0791 0.0986 0.0844 0.1128 0.1045 0.0800 0.1004 0.1057 0.1239 0.1245
va: 2.1058 1.9654 3.7269 3.5729 4.0369 4.0871 3.9549 3.9991 3.7907 3.9478 3.9457 3.9466 3.9332 3.4711 3.8098 3.9135 3.9162 3.9219 3.9988 3.9793 1.0148 1.0371 1.0141 1.0163 1.0158 1.0168 1.0131 1.0238 0.9972 1.0080 1.0146 1.0068 1.0044 1.0177 1.0077 1.0032 1.0012 0.9927 0.9937 1.0069 1.0080 1.0080 0.9947 1.0070 1.0016 0.9996
dispcorr: -0.024915417 hartree
energy: -852.126136814771
dipole: 12.01117 -12.28890 -0.27774 6.23333 -6.23137 0.00196 -1.31575 2.01521 0.69946
magnitude: 0.75259 au
magnitude: 1.91292 debye
