program: Orca
programVersion: 5.0.2
elementType: O O C C C C C C C C C C C C C C C C C C H H H H H H H H H H H H H H H H H H H H H H H H H H
charge: 0
multiplicity: 1
keywords: wb97x-d3
keywords: def2-TZVPP
keywords: def2/J RIJCOSX
keywords: DEFGRID2
keywords: scfconv7
keywords: smallprint printgap noloewdin
keywords: NOSOSCF
formula: C18H26O2
InChI: InChI=1/C18H26O2/c1-13(2)18-10-9-17(4,20-18)16(11-18)19-12-15-8-6-5-7-14(15)3/h5-8,13,16H,9-12H2,1-4H3
46 atoms
O  2.692267 -0.356879 -0.263412
O  -0.183324 -0.967641 -0.925942
C  2.470426 1.035744 -0.112228
C  1.682508 -0.834362 0.610248
C  0.404821 -0.161362 0.064536
C  0.979419 1.162896 -0.485856
C  2.586568 1.224979 1.415774
C  2.030395 -0.114914 1.92886
C  3.467849 1.84009 -0.932823
C  1.667371 -2.339255 0.680124
C  3.483526 1.455132 -2.408539
C  3.228557 3.337413 -0.762562
C  -1.463229 -0.548612 -1.310274
C  -2.524437 -0.812314 -0.263723
C  -3.638836 0.022919 -0.130295
C  -2.404465 -1.927784 0.559397
C  -4.595453 -0.283711 0.833647
C  -3.824702 1.23377 -1.001517
C  -3.363184 -2.218999 1.515957
C  -4.465345 -1.391314 1.655484
H  -0.312551 0.011471 0.876736
H  0.854256 1.198602 -1.570408
H  0.507005 2.050931 -0.0644
H  2.028181 2.088923 1.77738
H  3.629456 1.36469 1.708016
H  2.788818 -0.678235 2.474582
H  1.16961 -0.006445 2.590177
H  4.458066 1.609947 -0.521613
H  1.504125 -2.786744 -0.298161
H  2.6122 -2.711223 1.07771
H  0.870829 -2.67569 1.345227
H  4.277122 1.993685 -2.928915
H  3.65703 0.389382 -2.546108
H  2.545487 1.709706 -2.905522
H  3.99112 3.910605 -1.291027
H  3.259737 3.643806 0.283737
H  2.260238 3.636254 -1.169057
H  -1.705016 -1.104793 -2.221267
H  -1.460766 0.512596 -1.591998
H  -1.543772 -2.575242 0.45007
H  -5.45848 0.36235 0.942814
H  -3.863332 0.97564 -2.061274
H  -4.754128 1.748264 -0.761798
H  -3.014228 1.954982 -0.876573
H  -3.249552 -3.090543 2.147302
H  -5.221597 -1.605852 2.399144
totalener: -852.10243635 hartree
nucrepener: 1656.90425522 hartree
electener: -2509.00669157 hartree
oneelecener: -4447.45001839 hartree
twoeener: 1938.44332682 hartree
kineticenergy: 848.08606464 hartree
xcener: -85.354047624220 hartree
chargesum: 0.0000000
charge: -0.357773 -0.328794 0.401125 0.397287 0.064412 -0.397539 -0.220778 -0.242938 -0.001808 -0.300737 -0.272808 -0.291677 0.022702 -0.004252 -0.036227 -0.178638 -0.105856 -0.241881 -0.128852 -0.128903 0.078741 0.101539 0.093717 0.076531 0.087786 0.081374 0.076817 0.032724 0.104743 0.088709 0.072634 0.083697 0.107954 0.064382 0.089843 0.089978 0.077693 0.104833 0.078366 0.138121 0.101581 0.104800 0.081253 0.089413 0.123545 0.123161
qa: -0.3578 -0.3288 0.4011 0.3973 0.0644 -0.3975 -0.2208 -0.2429 -0.0018 -0.3007 -0.2728 -0.2917 0.0227 -0.0043 -0.0362 -0.1786 -0.1059 -0.2419 -0.1289 -0.1289 0.0787 0.1015 0.0937 0.0765 0.0878 0.0814 0.0768 0.0327 0.1047 0.0887 0.0726 0.0837 0.1080 0.0644 0.0898 0.0900 0.0777 0.1048 0.0784 0.1381 0.1016 0.1048 0.0813 0.0894 0.1235 0.1232
va: 2.1142 1.9867 3.6809 3.6794 3.9629 4.1098 3.9596 4.0048 3.7826 3.8974 3.9475 3.9464 3.9265 3.5762 3.7929 3.9914 3.9407 3.9234 3.9673 3.9766 1.0053 1.0142 1.0106 1.0148 1.0154 1.0156 1.0160 1.0230 1.0172 1.0122 1.0056 1.0047 1.0174 1.0065 1.0078 1.0034 1.0014 0.9872 0.9876 1.0076 1.0101 0.9921 1.0110 0.9942 1.0020 1.0003
dispcorr: -0.023459127 hartree
energy: -852.125895472563
dipole: 9.37820 -9.85300 -0.47480 11.25886 -10.57962 0.67923 -2.62905 2.96611 0.33706
magnitude: 0.89465 au
magnitude: 2.27403 debye
