program: Orca
programVersion: 5.0.2
elementType: O O C C C C C C C C C C C C C C C C C C H H H H H H H H H H H H H H H H H H H H H H H H H H
charge: 0
multiplicity: 1
keywords: wb97x-d3
keywords: def2-TZVPP
keywords: def2/J RIJCOSX
keywords: DEFGRID2
keywords: scfconv7
keywords: smallprint printgap noloewdin
keywords: NOSOSCF
formula: C18H26O2
InChI: InChI=1/C18H26O2/c1-13(2)18-10-9-17(4,20-18)16(11-18)19-12-15-8-6-5-7-14(15)3/h5-8,13,16H,9-12H2,1-4H3
46 atoms
O  2.175807 0.036963 -1.020566
O  -0.014682 -1.832292 -0.413931
C  1.865904 0.955022 0.017519
C  2.275022 -1.144078 -0.242446
C  0.89486 -1.199661 0.446026
C  0.630918 0.306252 0.675078
C  3.058438 0.766132 0.973634
C  3.309435 -0.745951 0.832608
C  1.685823 2.362108 -0.53291
C  2.651673 -2.337565 -1.081665
C  0.656238 2.437212 -1.655887
C  1.336583 3.339093 0.586332
C  -1.230105 -2.233314 0.158603
C  -2.203935 -1.110498 0.414843
C  -2.675438 -0.313554 -0.638574
C  -2.630294 -0.854549 1.710856
C  -3.551674 0.724377 -0.343057
C  -2.235175 -0.540852 -2.056151
C  -3.509894 0.181055 1.991322
C  -3.967646 0.977555 0.95685
H  0.948669 -1.754393 1.394571
H  -0.287403 0.61569 0.179614
H  0.525249 0.561524 1.730234
H  2.837627 1.073524 1.996052
H  3.918167 1.347386 0.63334
H  4.32004 -0.952996 0.477682
H  3.179093 -1.297701 1.765263
H  2.654977 2.659602 -0.951046
H  3.629678 -2.185248 -1.539129
H  2.709674 -3.232582 -0.461273
H  1.926052 -2.521471 -1.870614
H  0.894047 1.751395 -2.467274
H  -0.350454 2.205251 -1.301364
H  0.624714 3.446059 -2.070154
H  0.371599 3.099466 1.03735
H  1.268477 4.356664 0.199753
H  2.08526 3.343249 1.37955
H  -1.05636 -2.780078 1.09747
H  -1.665111 -2.950377 -0.543949
H  -2.260676 -1.474729 2.519622
H  -3.91987 1.347132 -1.149752
H  -2.82376 0.06162 -2.746643
H  -1.184246 -0.286686 -2.196094
H  -2.346546 -1.584684 -2.355173
H  -3.829218 0.363693 3.008863
H  -4.651305 1.79266 1.155122
totalener: -852.10220941 hartree
nucrepener: 1712.36166756 hartree
electener: -2564.46387697 hartree
oneelecener: -4558.58504208 hartree
twoeener: 1994.12116511 hartree
kineticenergy: 848.09914774 hartree
xcener: -85.356022847021 hartree
chargesum: 0.0000000
charge: -0.358475 -0.324543 0.392131 0.332770 0.068543 -0.317524 -0.241001 -0.205114 0.026385 -0.279268 -0.287105 -0.291735 -0.006637 0.005392 -0.092068 -0.114598 -0.100721 -0.206755 -0.136688 -0.123943 0.056915 0.083379 0.090325 0.074738 0.086152 0.081624 0.072982 0.031402 0.084318 0.077505 0.097040 0.106980 0.059482 0.088362 0.083189 0.087998 0.088052 0.077272 0.104932 0.103637 0.106352 0.079801 0.099554 0.091522 0.123538 0.123907
qa: -0.3585 -0.3245 0.3921 0.3328 0.0685 -0.3175 -0.2410 -0.2051 0.0264 -0.2793 -0.2871 -0.2917 -0.0066 0.0054 -0.0921 -0.1146 -0.1007 -0.2068 -0.1367 -0.1239 0.0569 0.0834 0.0903 0.0747 0.0862 0.0816 0.0730 0.0314 0.0843 0.0775 0.0970 0.1070 0.0595 0.0884 0.0832 0.0880 0.0881 0.0773 0.1049 0.1036 0.1064 0.0798 0.0996 0.0915 0.1235 0.1239
va: 2.1048 1.9666 3.7129 3.7544 3.9945 4.0477 3.9830 3.9679 3.7428 3.9201 3.9523 3.9494 3.9496 3.5116 3.8235 3.9157 3.9018 3.9337 3.9770 3.9671 1.0193 1.0291 1.0196 1.0157 1.0174 1.0156 1.0191 1.0231 1.0104 1.0045 1.0199 1.0143 1.0029 1.0099 1.0011 1.0077 1.0040 1.0030 0.9902 1.0103 1.0080 1.0062 1.0118 1.0045 1.0010 0.9997
dispcorr: -0.025927810 hartree
energy: -852.128137222707
dipole: 7.22409 -7.31404 -0.08996 6.79546 -6.78376 0.01170 -1.25887 1.96161 0.70273
magnitude: 0.70856 au
magnitude: 1.80103 debye
