program: Orca
programVersion: 5.0.2
elementType: O O C C C C C C C C C C C C C C C C C C H H H H H H H H H H H H H H H H H H H H H H H H H H
charge: 0
multiplicity: 1
keywords: wb97x-d3
keywords: def2-TZVPP
keywords: def2/J RIJCOSX
keywords: DEFGRID2
keywords: scfconv7
keywords: smallprint printgap noloewdin
keywords: NOSOSCF
formula: C18H26O2
InChI: InChI=1/C18H26O2/c1-13(2)18-10-9-17(4,20-18)16(11-18)19-12-15-8-6-5-7-14(15)3/h5-8,13,16H,9-12H2,1-4H3
46 atoms
O  1.778864 -0.035913 -0.940968
O  -0.25315 -0.591293 1.349529
C  2.516677 0.897079 -0.162769
C  1.762041 -1.119825 -0.019655
C  1.14262 -0.483256 1.247933
C  1.711688 0.949517 1.153663
C  3.812253 0.112634 0.121759
C  3.267308 -1.320514 0.260968
C  2.697275 2.207704 -0.913699
C  1.050217 -2.327696 -0.571138
C  1.378539 2.812793 -1.385514
C  3.483064 3.209101 -0.071976
C  -1.056043 0.134194 0.457348
C  -2.39905 -0.526907 0.302816
C  -3.328739 0.037912 -0.58055
C  -2.733567 -1.67594 1.007035
C  -4.566917 -0.572306 -0.735707
C  -2.996036 1.281622 -1.35327
C  -3.976537 -2.271135 0.842835
C  -4.897043 -1.720763 -0.031448
H  1.505589 -0.997615 2.140641
H  0.916115 1.694605 1.109368
H  2.329837 1.204745 2.014701
H  4.333439 0.464496 1.012232
H  4.504538 0.197691 -0.718463
H  3.700809 -1.986683 -0.486064
H  3.457476 -1.765925 1.238654
H  3.292306 1.976703 -1.805053
H  0.009177 -2.126052 -0.818955
H  1.549884 -2.689319 -1.469948
H  1.061246 -3.132363 0.164229
H  1.566338 3.714074 -1.970835
H  0.817386 2.122135 -2.013014
H  0.739948 3.104221 -0.549135
H  3.66501 4.1246 -0.635966
H  4.454333 2.818902 0.234341
H  2.936342 3.489129 0.830703
H  -0.590704 0.231936 -0.528896
H  -1.208334 1.161865 0.822998
H  -2.01791 -2.111082 1.68951
H  -5.285097 -0.139558 -1.422096
H  -3.823197 1.580003 -1.995393
H  -2.775486 2.124224 -0.693624
H  -2.120113 1.143709 -1.991572
H  -4.221706 -3.166022 1.399957
H  -5.8675 -2.17976 -0.167604
totalener: -852.10049851 hartree
nucrepener: 1670.00713550 hartree
electener: -2522.10763401 hartree
oneelecener: -4473.62832367 hartree
twoeener: 1951.52068966 hartree
kineticenergy: 848.08126234 hartree
xcener: -85.357574450146 hartree
chargesum: 0.0000000
charge: -0.370413 -0.341248 0.344315 0.281430 0.114314 -0.328298 -0.237961 -0.190365 0.008491 -0.271110 -0.286156 -0.294386 0.043934 0.066741 -0.121215 -0.192797 -0.074111 -0.243879 -0.118883 -0.140226 0.084051 0.109551 0.099536 0.076106 0.088134 0.078539 0.077425 0.033630 0.093420 0.088398 0.087242 0.092042 0.099299 0.067451 0.090048 0.091195 0.080885 0.095269 0.088323 0.122951 0.101592 0.080385 0.091294 0.095371 0.119708 0.119984
qa: -0.3704 -0.3412 0.3443 0.2814 0.1143 -0.3283 -0.2380 -0.1904 0.0085 -0.2711 -0.2862 -0.2944 0.0439 0.0667 -0.1212 -0.1928 -0.0741 -0.2439 -0.1189 -0.1402 0.0841 0.1096 0.0995 0.0761 0.0881 0.0785 0.0774 0.0336 0.0934 0.0884 0.0872 0.0920 0.0993 0.0675 0.0900 0.0912 0.0809 0.0953 0.0883 0.1230 0.1016 0.0804 0.0913 0.0954 0.1197 0.1200
va: 2.0513 2.0076 3.6708 3.7093 3.9834 3.9954 3.9863 3.9676 3.7878 3.9462 3.9394 3.9534 3.8343 3.5495 3.9071 3.9960 3.8982 3.9459 3.9493 3.9837 1.0078 1.0098 1.0158 1.0161 1.0150 1.0190 1.0203 1.0226 1.0056 1.0120 1.0034 1.0095 1.0140 1.0056 1.0078 1.0036 1.0002 0.9887 0.9855 1.0313 1.0091 1.0119 0.9976 0.9970 1.0025 1.0011
dispcorr: -0.024541905 hartree
energy: -852.125040412510
dipole: 12.16881 -11.41816 0.75065 10.49871 -10.13326 0.36545 -4.02540 4.06777 0.04237
magnitude: 0.83596 au
magnitude: 2.12483 debye
