program: Orca
programVersion: 5.0.2
elementType: O O C C C C C C C C C C C C C C C C C C H H H H H H H H H H H H H H H H H H H H H H H H H H
charge: 0
multiplicity: 1
keywords: wb97x-d3
keywords: def2-TZVPP
keywords: def2/J RIJCOSX
keywords: DEFGRID2
keywords: scfconv7
keywords: smallprint printgap noloewdin
keywords: NOSOSCF
formula: C18H26O2
InChI: InChI=1/C18H26O2/c1-13(2)18-10-9-17(4,20-18)16(11-18)19-12-15-8-6-5-7-14(15)3/h5-8,13,16H,9-12H2,1-4H3
46 atoms
O  2.459463 0.035602 -0.73095
O  -0.431615 -0.367006 -1.211479
C  2.293989 1.195309 0.068889
C  1.602958 -0.842554 -0.020163
C  0.262552 -0.081312 -0.024879
C  0.760715 1.378353 0.056705
C  2.685445 0.690566 1.471548
C  2.165198 -0.758004 1.414361
C  3.083626 2.365033 -0.499724
C  1.588445 -2.222994 -0.624148
C  2.910997 3.60965 0.365484
C  4.56197 2.045967 -0.699563
C  -1.713458 0.201417 -1.295613
C  -2.694075 -0.359693 -0.297565
C  -3.113106 -1.695451 -0.367884
C  -3.181329 0.457068 0.714859
C  -4.016766 -2.158749 0.581695
C  -2.617099 -2.618296 -1.443826
C  -4.080765 -0.017582 1.658062
C  -4.499366 -1.334616 1.58831
H  -0.34665 -0.358619 0.844833
H  0.457948 1.93739 -0.832842
H  0.38481 1.913995 0.929434
H  2.234214 1.280251 2.270142
H  3.765865 0.716871 1.618648
H  2.977164 -1.47577 1.54023
H  1.415938 -0.983691 2.174603
H  2.655411 2.577447 -1.486455
H  2.582907 -2.668371 -0.578717
H  0.907597 -2.869199 -0.068497
H  1.266722 -2.204298 -1.663392
H  3.427329 4.461314 -0.078924
H  1.86333 3.890615 0.481736
H  3.329126 3.462619 1.363405
H  5.074308 1.880433 0.250062
H  5.063514 2.88084 -1.191319
H  4.704488 1.161039 -1.317094
H  -2.054896 0.009648 -2.316101
H  -1.673884 1.293961 -1.181335
H  -2.847372 1.487523 0.763718
H  -4.353997 -3.187141 0.529387
H  -2.819187 -2.22028 -2.440552
H  -1.540296 -2.771202 -1.379986
H  -3.101632 -3.591501 -1.378247
H  -4.446916 0.635613 2.439048
H  -5.202359 -1.724126 2.313019
totalener: -852.10366861 hartree
nucrepener: 1660.95971226 hartree
electener: -2513.06338087 hartree
oneelecener: -4455.61842161 hartree
twoeener: 1942.55504074 hartree
kineticenergy: 848.09464915 hartree
xcener: -85.354185516257 hartree
chargesum: 0.0000000
charge: -0.356275 -0.319725 0.376953 0.405133 0.028079 -0.317975 -0.259389 -0.224262 -0.000455 -0.312443 -0.293320 -0.275388 0.033713 -0.032410 -0.074998 -0.097843 -0.103332 -0.222786 -0.148750 -0.117723 0.074636 0.091637 0.087625 0.079618 0.094412 0.080888 0.076195 0.034428 0.089165 0.080126 0.100531 0.089111 0.088400 0.079936 0.065284 0.083721 0.106195 0.105232 0.073775 0.107573 0.105070 0.089282 0.106089 0.076789 0.123642 0.123831
qa: -0.3563 -0.3197 0.3770 0.4051 0.0281 -0.3180 -0.2594 -0.2243 -0.0005 -0.3124 -0.2933 -0.2754 0.0337 -0.0324 -0.0750 -0.0978 -0.1033 -0.2228 -0.1487 -0.1177 0.0746 0.0916 0.0876 0.0796 0.0944 0.0809 0.0762 0.0344 0.0892 0.0801 0.1005 0.0891 0.0884 0.0799 0.0653 0.0837 0.1062 0.1052 0.0738 0.1076 0.1051 0.0893 0.1061 0.0768 0.1236 0.1238
va: 2.1087 1.9868 3.7084 3.6755 4.0632 3.9962 4.0075 3.9804 3.7709 3.8988 3.9489 3.9460 3.8772 3.5564 3.8649 3.8832 3.9242 3.9302 3.9951 3.9655 1.0079 1.0212 1.0118 1.0146 1.0118 1.0161 1.0183 1.0223 1.0132 1.0018 1.0170 1.0080 1.0040 1.0004 1.0075 1.0051 1.0176 0.9944 0.9993 1.0085 1.0082 1.0007 0.9975 1.0085 1.0016 0.9998
dispcorr: -0.023844805 hartree
energy: -852.127513417912
dipole: 13.06239 -13.44756 -0.38516 5.31950 -5.13083 0.18867 1.26963 -0.68700 0.58263
magnitude: 0.72347 au
magnitude: 1.83891 debye
