program: Orca
programVersion: 5.0.2
elementType: O O C C C C C C C C C C C C C C C C C C H H H H H H H H H H H H H H H H H H H H H H H H H H
charge: 0
multiplicity: 1
keywords: wb97x-d3
keywords: def2-TZVPP
keywords: def2/J RIJCOSX
keywords: DEFGRID2
keywords: scfconv7
keywords: smallprint printgap noloewdin
keywords: NOSOSCF
formula: C18H26O2
InChI: InChI=1/C18H26O2/c1-13(2)18-10-9-17(4,20-18)16(11-18)19-12-15-8-6-5-7-14(15)3/h5-8,13,16H,9-12H2,1-4H3
46 atoms
O  2.292953 0.405243 -1.003038
O  -0.296004 -0.681384 0.011726
C  2.651989 1.010362 0.229068
C  2.042206 -0.910693 -0.538323
C  0.99027 -0.688513 0.566862
C  1.427125 0.68765 1.113545
C  3.798994 0.103504 0.729756
C  3.363476 -1.263816 0.174067
C  2.993624 2.486232 0.03985
C  1.647015 -1.837381 -1.658879
C  4.114552 2.691602 -0.9798
C  1.78251 3.327008 -0.365261
C  -1.318724 -0.677733 0.958971
C  -2.664619 -0.684718 0.288555
C  -3.815114 -0.826157 1.074221
C  -2.78561 -0.54062 -1.087396
C  -5.057842 -0.829173 0.45292
C  -3.716884 -0.974733 2.565097
C  -4.034646 -0.545009 -1.691617
C  -5.175244 -0.692334 -0.921773
H  1.054974 -1.478714 1.329515
H  0.624847 1.409269 0.956727
H  1.666217 0.683146 2.177752
H  3.88914 0.122497 1.816586
H  4.763942 0.402376 0.322844
H  4.085438 -1.645088 -0.549535
H  3.240769 -2.030958 0.940149
H  3.34971 2.845742 1.0129
H  1.434447 -2.833117 -1.269285
H  0.759517 -1.485923 -2.180452
H  2.459104 -1.926704 -2.380929
H  3.80979 2.357576 -1.971257
H  4.367796 3.749975 -1.049383
H  5.030296 2.163123 -0.717702
H  1.310108 2.926738 -1.262654
H  2.088202 4.351589 -0.579911
H  1.0261 3.381228 0.416784
H  -1.249236 0.202868 1.619135
H  -1.230364 -1.554288 1.622115
H  -1.898791 -0.425215 -1.694063
H  -5.949452 -0.940076 1.058569
H  -3.198307 -0.131573 3.027084
H  -4.703718 -1.036697 3.021044
H  -3.171186 -1.877445 2.849818
H  -4.111757 -0.435488 -2.765469
H  -6.153026 -0.698672 -1.385194
totalener: -852.10158205 hartree
nucrepener: 1631.33017999 hartree
electener: -2483.43176204 hartree
oneelecener: -4396.35230278 hartree
twoeener: 1912.92054074 hartree
kineticenergy: 848.08446816 hartree
xcener: -85.354552924442 hartree
chargesum: 0.0000000
charge: -0.369662 -0.318621 0.326635 0.335655 0.058050 -0.311723 -0.230344 -0.217169 0.042845 -0.269318 -0.277623 -0.287350 0.042086 0.077763 -0.095686 -0.179509 -0.086932 -0.240792 -0.130662 -0.133665 0.056034 0.107482 0.088496 0.077048 0.092923 0.080493 0.072944 0.031435 0.080853 0.095107 0.084220 0.096096 0.081761 0.076059 0.104419 0.081274 0.073561 0.073947 0.069487 0.131862 0.102229 0.091629 0.079749 0.095156 0.120999 0.120758
qa: -0.3697 -0.3186 0.3266 0.3357 0.0580 -0.3117 -0.2303 -0.2172 0.0428 -0.2693 -0.2776 -0.2874 0.0421 0.0778 -0.0957 -0.1795 -0.0869 -0.2408 -0.1307 -0.1337 0.0560 0.1075 0.0885 0.0770 0.0929 0.0805 0.0729 0.0314 0.0809 0.0951 0.0842 0.0961 0.0818 0.0761 0.1044 0.0813 0.0736 0.0739 0.0695 0.1319 0.1022 0.0916 0.0797 0.0952 0.1210 0.1208
va: 2.0972 2.0098 3.7174 3.7823 3.9832 3.9613 3.9755 3.9638 3.7466 3.9269 3.9516 3.9466 3.9008 3.6054 3.8936 3.9970 3.9127 3.9457 3.9599 3.9763 1.0187 1.0140 1.0182 1.0198 1.0171 1.0159 1.0197 1.0165 1.0053 1.0130 1.0098 1.0115 1.0056 1.0111 1.0122 1.0071 1.0069 0.9808 0.9921 1.0215 1.0090 0.9952 1.0110 0.9965 1.0023 1.0007
dispcorr: -0.022054352 hartree
energy: -852.123636400127
dipole: 12.48209 -12.17302 0.30907 5.73737 -5.90237 -0.16500 4.08521 -3.11458 0.97062
magnitude: 1.03192 au
magnitude: 2.62293 debye
