program: Orca
programVersion: 5.0.2
elementType: O O C C C C C C C C C C C C C C C C C C H H H H H H H H H H H H H H H H H H H H H H H H H H
charge: 0
multiplicity: 1
keywords: wb97x-d3
keywords: def2-TZVPP
keywords: def2/J RIJCOSX
keywords: DEFGRID2
keywords: scfconv7
keywords: smallprint printgap noloewdin
keywords: NOSOSCF
formula: C18H26O2
InChI: InChI=1/C18H26O2/c1-13(2)18-10-9-17(4,20-18)16(11-18)19-12-15-8-6-5-7-14(15)3/h5-8,13,16H,9-12H2,1-4H3
46 atoms
O  1.678243 1.173702 -0.644716
O  -0.350566 -0.52916 0.69812
C  2.623262 1.012784 0.40146
C  1.453544 -0.19143 -0.951077
C  1.005225 -0.761344 0.41896
C  1.867485 0.084202 1.372262
C  3.724866 0.174782 -0.276334
C  2.882388 -0.715781 -1.208996
C  3.02897 2.358766 0.982358
C  0.499082 -0.333907 -2.109028
C  4.07564 2.179307 2.078401
C  3.516061 3.342358 -0.077136
C  -1.235322 -1.557231 0.360135
C  -2.610873 -1.008036 0.091201
C  -3.651851 -1.893261 -0.216463
C  -2.859166 0.358091 0.129757
C  -4.916654 -1.379591 -0.475244
C  -3.410402 -3.374044 -0.274606
C  -4.128725 0.854058 -0.131166
C  -5.161952 -0.01512 -0.433858
H  1.232943 -1.833248 0.495901
H  1.215604 0.658356 2.034079
H  2.527861 -0.518715 1.996097
H  4.320316 -0.392584 0.439519
H  4.411762 0.803468 -0.844395
H  3.156426 -0.570476 -2.254995
H  2.982583 -1.781948 -0.997027
H  2.129195 2.784854 1.441623
H  0.381561 -1.381773 -2.388092
H  -0.485002 0.074229 -1.880612
H  0.88794 0.194563 -2.980264
H  3.735292 1.509306 2.869119
H  5.007906 1.776569 1.677226
H  4.311704 3.136625 2.544454
H  2.774911 3.494154 -0.859633
H  4.440571 3.00559 -0.549676
H  3.724553 4.311876 0.377774
H  -1.283081 -2.299103 1.173681
H  -0.896162 -2.109495 -0.528363
H  -2.053874 1.040134 0.362436
H  -5.723748 -2.061433 -0.715883
H  -3.063636 -3.769189 0.683084
H  -4.320103 -3.912064 -0.536849
H  -2.653735 -3.635081 -1.018516
H  -4.304611 1.921298 -0.097565
H  -6.15507 0.362721 -0.638981
totalener: -852.10204282 hartree
nucrepener: 1636.03853182 hartree
electener: -2488.14057464 hartree
oneelecener: -4405.78898964 hartree
twoeener: 1917.64841499 hartree
kineticenergy: 848.08400145 hartree
xcener: -85.353356858443 hartree
chargesum: -0.0000000
charge: -0.358113 -0.343697 0.353396 0.362414 0.079288 -0.261563 -0.254543 -0.222872 -0.005928 -0.321038 -0.292131 -0.274905 -0.013145 0.096587 -0.112596 -0.184381 -0.080438 -0.235797 -0.116949 -0.142567 0.064174 0.094470 0.084406 0.079048 0.095573 0.077117 0.076794 0.034672 0.080567 0.108172 0.091846 0.089960 0.078265 0.089771 0.105512 0.065992 0.084527 0.102936 0.080143 0.133726 0.102267 0.094119 0.080223 0.091076 0.122764 0.120859
qa: -0.3581 -0.3437 0.3534 0.3624 0.0793 -0.2616 -0.2545 -0.2229 -0.0059 -0.3210 -0.2921 -0.2749 -0.0131 0.0966 -0.1126 -0.1844 -0.0804 -0.2358 -0.1169 -0.1426 0.0642 0.0945 0.0844 0.0790 0.0956 0.0771 0.0768 0.0347 0.0806 0.1082 0.0918 0.0900 0.0783 0.0898 0.1055 0.0660 0.0845 0.1029 0.0801 0.1337 0.1023 0.0941 0.0802 0.0911 0.1228 0.1209
va: 2.0800 1.9779 3.7014 3.6749 3.9360 4.0378 4.0044 4.0013 3.7909 3.8884 3.9470 3.9441 3.9581 3.5507 3.9055 3.9652 3.9031 3.9323 3.9559 3.9869 1.0104 1.0374 1.0136 1.0169 1.0107 1.0191 1.0154 1.0223 1.0027 1.0135 1.0154 1.0042 1.0004 1.0083 1.0170 1.0072 1.0051 0.9925 0.9689 1.0315 1.0088 0.9981 1.0110 0.9950 1.0013 1.0009
dispcorr: -0.022788666 hartree
energy: -852.124831484521
dipole: 15.48684 -14.97217 0.51467 0.70295 -1.52543 -0.82248 0.09997 -0.07493 0.02505
magnitude: 0.97056 au
magnitude: 2.46697 debye
