program: Orca
programVersion: 5.0.2
elementType: O O C C C C C C C C C C C C C C C C C C H H H H H H H H H H H H H H H H H H H H H H H H H H
charge: 0
multiplicity: 1
keywords: wb97x-d3
keywords: def2-TZVPP
keywords: def2/J RIJCOSX
keywords: DEFGRID2
keywords: scfconv7
keywords: smallprint printgap noloewdin
keywords: NOSOSCF
formula: C18H26O2
InChI: InChI=1/C18H26O2/c1-13(2)18-10-9-17(4,20-18)16(11-18)19-12-15-8-6-5-7-14(15)3/h5-8,13,16H,9-12H2,1-4H3
46 atoms
O  2.218441 0.343057 -1.055272
O  -0.32429 -0.754731 0.005896
C  2.5074 1.118513 0.097853
C  2.040932 -0.917302 -0.432247
C  0.936179 -0.625231 0.603135
C  1.282998 0.828332 0.992509
C  3.710403 0.370954 0.706484
C  3.359328 -1.085793 0.352323
C  2.704114 2.583462 -0.263844
C  1.746963 -2.003933 -1.433464
C  3.013011 3.414285 0.978846
C  3.770943 2.793456 -1.333894
C  -1.38615 -0.695722 0.907446
C  -2.702424 -0.775536 0.184468
C  -3.882871 -0.889263 0.929189
C  -2.767239 -0.719088 -1.201684
C  -5.097751 -0.953197 0.258157
C  -3.846244 -0.94328 2.42935
C  -3.989116 -0.783494 -1.855861
C  -5.158833 -0.903143 -1.126135
H  1.011335 -1.312447 1.458821
H  0.45819 1.496196 0.729342
H  1.489487 0.956264 2.05562
H  3.811306 0.542359 1.778604
H  4.647667 0.675537 0.239515
H  4.120659 -1.53552 -0.286683
H  3.250685 -1.732103 1.224723
H  1.749544 2.932424 -0.674921
H  1.60674 -2.957755 -0.924086
H  0.846532 -1.795078 -2.006895
H  2.580824 -2.114854 -2.127118
H  2.237502 3.324485 1.740617
H  3.961633 3.118058 1.431078
H  3.093658 4.471235 0.722733
H  4.765697 2.522729 -0.974921
H  3.811468 3.844636 -1.6230
H  3.565971 2.209519 -2.229327
H  -1.357467 0.234942 1.498311
H  -1.312925 -1.516133 1.640357
H  -1.857362 -0.622966 -1.776719
H  -6.01249 -1.044108 0.831822
H  -4.850721 -0.995421 2.846425
H  -3.298686 -1.816267 2.79231
H  -3.361712 -0.063443 2.858718
H  -4.022335 -0.738956 -2.936599
H  -6.115909 -0.955506 -1.628338
totalener: -852.10396595 hartree
nucrepener: 1624.43387803 hartree
electener: -2476.53784398 hartree
oneelecener: -4382.50505238 hartree
twoeener: 1905.96720840 hartree
kineticenergy: 848.08602518 hartree
xcener: -85.353560001525 hartree
chargesum: -0.0000000
charge: -0.357162 -0.318934 0.375552 0.355614 0.050232 -0.315001 -0.262390 -0.215749 -0.000880 -0.270253 -0.293478 -0.275302 0.041399 0.078537 -0.096083 -0.181066 -0.086566 -0.241626 -0.129035 -0.134518 0.057705 0.099909 0.088312 0.078621 0.097022 0.081702 0.075190 0.035355 0.079588 0.096533 0.084690 0.089048 0.080098 0.090212 0.065274 0.084710 0.106527 0.076000 0.068345 0.130341 0.101821 0.079583 0.096440 0.091209 0.121736 0.120736
qa: -0.3572 -0.3189 0.3756 0.3556 0.0502 -0.3150 -0.2624 -0.2157 -0.0009 -0.2703 -0.2935 -0.2753 0.0414 0.0785 -0.0961 -0.1811 -0.0866 -0.2416 -0.1290 -0.1345 0.0577 0.0999 0.0883 0.0786 0.0970 0.0817 0.0752 0.0354 0.0796 0.0965 0.0847 0.0890 0.0801 0.0902 0.0653 0.0847 0.1065 0.0760 0.0683 0.1303 0.1018 0.0796 0.0964 0.0912 0.1217 0.1207
va: 2.1008 2.0079 3.6918 3.7373 4.0084 3.9498 4.0090 3.9762 3.7772 3.9235 3.9487 3.9448 3.9074 3.6066 3.8932 3.9991 3.9120 3.9448 3.9584 3.9776 1.0179 1.0186 1.0116 1.0149 1.0112 1.0163 1.0187 1.0228 1.0052 1.0130 1.0096 1.0034 1.0003 1.0081 1.0072 1.0052 1.0174 0.9807 0.9915 1.0246 1.0090 1.0109 0.9961 0.9953 1.0020 1.0007
dispcorr: -0.021983078 hartree
energy: -852.125949025204
dipole: 13.92216 -13.65212 0.27004 6.82662 -6.85168 -0.02506 6.28250 -5.29470 0.98779
magnitude: 1.02435 au
magnitude: 2.60368 debye
