program: Orca
programVersion: 5.0.2
elementType: O O C C C C C C C C C C C C C C C C C C H H H H H H H H H H H H H H H H H H H H H H H H H H
charge: 0
multiplicity: 1
keywords: wb97x-d3
keywords: def2-TZVPP
keywords: def2/J RIJCOSX
keywords: DEFGRID2
keywords: scfconv7
keywords: smallprint printgap noloewdin
keywords: NOSOSCF
formula: C18H26O2
InChI: InChI=1/C18H26O2/c1-13(2)18-10-9-17(4,20-18)16(11-18)19-12-15-8-6-5-7-14(15)3/h5-8,13,16H,9-12H2,1-4H3
46 atoms
O  2.001081 0.077547 -1.084429
O  -0.365658 -0.800892 0.458122
C  2.38722 1.086128 -0.164677
C  1.936843 -1.020925 -0.188545
C  0.940011 -0.521092 0.876108
C  1.276439 0.986833 0.901552
C  3.673455 0.500756 0.451762
C  3.338576 -1.001922 0.455333
C  2.495918 2.439243 -0.851399
C  1.571231 -2.300345 -0.895254
C  2.915256 3.519764 0.141535
C  3.430449 2.419154 -2.056443
C  -1.353959 -0.48011 1.400464
C  -2.702168 -0.796722 0.821698
C  -3.209736 -0.066788 -0.261623
C  -3.450976 -1.833462 1.361825
C  -4.460349 -0.40942 -0.762471
C  -2.43848 1.062855 -0.881265
C  -4.699204 -2.162515 0.854493
C  -5.203719 -1.445639 -0.215802
H  1.129463 -0.999846 1.849026
H  0.408672 1.57574 0.591847
H  1.58732 1.345286 1.883438
H  3.880137 0.899835 1.445145
H  4.545013 0.708729 -0.1699
H  4.039877 -1.567614 -0.159795
H  3.351455 -1.44928 1.450472
H  1.491023 2.685414 -1.215131
H  0.604979 -2.227764 -1.389194
H  2.326707 -2.547546 -1.641747
H  1.523631 -3.124406 -0.182618
H  2.231916 3.591824 0.988766
H  3.91625 3.332829 0.535611
H  2.936538 4.497305 -0.341476
H  4.46649 2.238905 -1.763419
H  3.405485 3.382838 -2.567375
H  3.146283 1.65294 -2.775383
H  -1.304793 0.583032 1.682229
H  -1.20426 -1.050769 2.329583
H  -3.047153 -2.397603 2.19422
H  -4.862149 0.149286 -1.599291
H  -3.021891 1.552236 -1.659886
H  -2.18022 1.825969 -0.142974
H  -1.504513 0.717194 -1.32351
H  -5.267078 -2.973648 1.290365
H  -6.174743 -1.687576 -0.627848
totalener: -852.10367441 hartree
nucrepener: 1647.13594247 hartree
electener: -2499.23961688 hartree
oneelecener: -4427.98488622 hartree
twoeener: 1928.74526934 hartree
kineticenergy: 848.09522906 hartree
xcener: -85.351800564209 hartree
chargesum: 0.0000000
charge: -0.362017 -0.311713 0.390524 0.326370 0.080184 -0.321895 -0.259928 -0.212205 -0.004191 -0.270888 -0.295014 -0.273439 -0.012124 -0.006296 -0.032689 -0.103597 -0.106912 -0.235705 -0.146263 -0.121942 0.061596 0.092266 0.092158 0.080399 0.095953 0.080330 0.075870 0.034817 0.101689 0.083377 0.077960 0.089456 0.080858 0.090064 0.065988 0.084366 0.106145 0.100123 0.065113 0.102743 0.103565 0.081296 0.077593 0.112479 0.121437 0.122098
qa: -0.3620 -0.3117 0.3905 0.3264 0.0802 -0.3219 -0.2599 -0.2122 -0.0042 -0.2709 -0.2950 -0.2734 -0.0121 -0.0063 -0.0327 -0.1036 -0.1069 -0.2357 -0.1463 -0.1219 0.0616 0.0923 0.0922 0.0804 0.0960 0.0803 0.0759 0.0348 0.1017 0.0834 0.0780 0.0895 0.0809 0.0901 0.0660 0.0844 0.1061 0.1001 0.0651 0.1027 0.1036 0.0813 0.0776 0.1125 0.1214 0.1221
va: 2.0828 1.9805 3.6442 3.7636 3.9760 3.9586 4.0146 3.9810 3.7928 3.9222 3.9511 3.9433 3.9111 3.7375 3.7876 3.9491 3.9283 3.8874 3.9874 3.9739 1.0174 1.0146 1.0154 1.0143 1.0115 1.0177 1.0187 1.0186 1.0170 1.0091 1.0052 1.0031 1.0005 1.0078 1.0073 1.0053 1.0175 0.9797 1.0079 1.0118 1.0100 1.0146 1.0016 1.0140 1.0024 1.0005
dispcorr: -0.023142772 hartree
energy: -852.126817181562
dipole: 15.42933 -15.10695 0.32238 10.13502 -9.88947 0.24555 -1.29185 1.99673 0.70489
magnitude: 0.81308 au
magnitude: 2.06668 debye
