program: Orca
programVersion: 5.0.2
elementType: O O C C C C C C C C C C C C C C C C C C H H H H H H H H H H H H H H H H H H H H H H H H H H
charge: 0
multiplicity: 1
keywords: wb97x-d3
keywords: def2-TZVPP
keywords: def2/J RIJCOSX
keywords: DEFGRID2
keywords: scfconv7
keywords: smallprint printgap noloewdin
keywords: NOSOSCF
formula: C18H26O2
InChI: InChI=1/C18H26O2/c1-13(2)18-10-9-17(4,20-18)16(11-18)19-12-15-8-6-5-7-14(15)3/h5-8,13,16H,9-12H2,1-4H3
46 atoms
O  2.13253 -0.053277 -1.113136
O  -0.30075 -0.750815 0.440146
C  2.554936 0.967683 -0.223716
C  1.993212 -1.112318 -0.179265
C  1.015511 -0.518532 0.854934
C  1.42526 0.97116 0.826109
C  3.79765 0.333408 0.434229
C  3.385879 -1.148766 0.482766
C  2.810564 2.26812 -0.970863
C  1.56091 -2.393548 -0.844042
C  1.610721 2.729758 -1.792398
C  3.271803 3.364194 -0.014719
C  -1.272743 -0.366019 1.376332
C  -2.631227 -0.69163 0.828245
C  -3.159975 0.022819 -0.254727
C  -3.364244 -1.727469 1.391348
C  -4.417083 -0.330925 -0.731031
C  -2.40029 1.146241 -0.899461
C  -4.61788 -2.069696 0.907028
C  -5.144692 -1.366058 -0.1615
H  1.174396 -0.966795 1.847568
H  0.585715 1.583609 0.490025
H  1.745189 1.352256 1.796583
H  4.01715 0.752789 1.41645
H  4.680965 0.483231 -0.190054
H  4.063207 -1.77071 -0.104242
H  3.363136 -1.5626 1.492104
H  3.630982 2.065257 -1.669423
H  0.606577 -2.282083 -1.353866
H  2.308721 -2.712962 -1.570515
H  1.454921 -3.186367 -0.102989
H  1.264771 1.952926 -2.471832
H  0.769791 3.021403 -1.159836
H  1.877244 3.602854 -2.389901
H  2.495459 3.614617 0.711245
H  3.507987 4.277355 -0.562172
H  4.166643 3.078687 0.539612
H  -1.202237 0.708383 1.604149
H  -1.120586 -0.892746 2.330497
H  -2.943315 -2.280243 2.2229
H  -4.835744 0.216657 -1.566939
H  -1.459644 0.799906 -1.327722
H  -2.984386 1.608006 -1.694259
H  -2.155315 1.931443 -0.179887
H  -5.173265 -2.88063 1.359093
H  -6.120771 -1.618509 -0.554896
totalener: -852.10384929 hartree
nucrepener: 1654.58979155 hartree
electener: -2506.69364085 hartree
oneelecener: -4442.90086503 hartree
twoeener: 1936.20722418 hartree
kineticenergy: 848.09447844 hartree
xcener: -85.351536914677 hartree
chargesum: 0.0000000
charge: -0.355291 -0.312516 0.381499 0.318292 0.089670 -0.340240 -0.230074 -0.216795 0.009695 -0.270269 -0.283051 -0.292336 -0.007726 -0.012607 -0.024961 -0.103173 -0.107079 -0.237680 -0.147241 -0.121278 0.062087 0.087784 0.093563 0.076088 0.088088 0.080843 0.074196 0.033386 0.101342 0.083218 0.077845 0.108890 0.062227 0.088934 0.079655 0.089822 0.089862 0.097761 0.065579 0.102182 0.103329 0.112430 0.081084 0.079631 0.121226 0.122109
qa: -0.3553 -0.3125 0.3815 0.3183 0.0897 -0.3402 -0.2301 -0.2168 0.0097 -0.2703 -0.2831 -0.2923 -0.0077 -0.0126 -0.0250 -0.1032 -0.1071 -0.2377 -0.1472 -0.1213 0.0621 0.0878 0.0936 0.0761 0.0881 0.0808 0.0742 0.0334 0.1013 0.0832 0.0778 0.1089 0.0622 0.0889 0.0797 0.0898 0.0899 0.0978 0.0656 0.1022 0.1033 0.1124 0.0811 0.0796 0.1212 0.1221
va: 2.1055 1.9804 3.6856 3.7771 3.9621 3.9958 3.9687 3.9869 3.7650 3.9220 3.9475 3.9495 3.9127 3.7453 3.7774 3.9507 3.9310 3.8814 3.9870 3.9738 1.0170 1.0128 1.0162 1.0149 1.0156 1.0168 1.0193 1.0232 1.0175 1.0095 1.0054 1.0157 1.0041 1.0078 1.0004 1.0079 1.0035 0.9794 1.0081 1.0114 1.0103 1.0116 1.0148 1.0008 1.0024 1.0005
dispcorr: -0.023556152 hartree
energy: -852.127405446413
dipole: 12.88643 -12.53435 0.35208 10.29388 -10.05106 0.24281 -1.07533 1.76269 0.68736
magnitude: 0.80956 au
magnitude: 2.05774 debye
