program: Orca
programVersion: 5.0.2
elementType: O O C C C C C C C C C C C C C C C C C C H H H H H H H H H H H H H H H H H H H H H H H H H H
charge: 0
multiplicity: 1
keywords: wb97x-d3
keywords: def2-TZVPP
keywords: def2/J RIJCOSX
keywords: DEFGRID2
keywords: scfconv7
keywords: smallprint printgap noloewdin
keywords: NOSOSCF
formula: C18H26O2
InChI: InChI=1/C18H26O2/c1-13(2)18-10-9-17(4,20-18)16(11-18)19-12-15-8-6-5-7-14(15)3/h5-8,13,16H,9-12H2,1-4H3
46 atoms
O  2.352564 0.153159 -0.937027
O  0.006248 -1.665923 -0.911744
C  1.899433 0.959701 0.140116
C  2.273875 -1.114037 -0.308697
C  0.797371 -1.173978 0.13834
C  0.545685 0.309984 0.49047
C  2.897605 0.591439 1.254818
C  3.125552 -0.903028 0.962866
C  1.868505 2.42772 -0.257696
C  2.743257 -2.220935 -1.217099
C  1.041574 2.685444 -1.514806
C  1.377763 3.293245 0.899238
C  -1.271024 -2.117405 -0.542062
C  -2.24887 -0.999523 -0.262625
C  -2.81375 -0.782352 0.997078
C  -2.553673 -0.132309 -1.308578
C  -3.670606 0.304024 1.165652
C  -2.518862 -1.675642 2.171353
C  -3.401041 0.946068 -1.126959
C  -3.963253 1.165144 0.121858
H  0.686222 -1.828706 1.015557
H  -0.254179 0.712912 -0.127927
H  0.257644 0.460018 1.531863
H  2.506384 0.781658 2.254549
H  3.820963 1.165087 1.149358
H  4.174754 -1.113028 0.750308
H  2.828274 -1.558655 1.78311
H  2.904647 2.712555 -0.476547
H  2.675874 -3.182051 -0.706445
H  2.146091 -2.27934 -2.124199
H  3.78521 -2.06499 -1.497282
H  1.359994 2.055702 -2.34331
H  -0.021539 2.504504 -1.345975
H  1.144371 3.726053 -1.825373
H  1.987729 3.171275 1.795336
H  0.344915 3.056459 1.162642
H  1.407947 4.349141 0.627922
H  -1.206147 -2.804493 0.311169
H  -1.632386 -2.706327 -1.388913
H  -2.100381 -0.299703 -2.27857
H  -4.113244 0.478996 2.139074
H  -2.839566 -2.704003 1.998159
H  -1.453068 -1.705755 2.404825
H  -3.034493 -1.324643 3.06417
H  -3.62193 1.610052 -1.95233
H  -4.629748 2.00238 0.282984
totalener: -852.09991925 hartree
nucrepener: 1701.68254839 hartree
electener: -2553.78246764 hartree
oneelecener: -4537.19827965 hartree
twoeener: 1983.41581201 hartree
kineticenergy: 848.09513836 hartree
xcener: -85.355043229455 hartree
chargesum: 0.0000000
charge: -0.358478 -0.315653 0.406194 0.339699 0.043753 -0.316303 -0.241143 -0.211399 0.013446 -0.277259 -0.271818 -0.292118 0.001364 -0.024556 0.006492 -0.167561 -0.110676 -0.239742 -0.136696 -0.117652 0.048915 0.087906 0.089387 0.075166 0.085221 0.082080 0.070896 0.031458 0.076314 0.097623 0.084686 0.105645 0.060543 0.084279 0.087180 0.081514 0.088454 0.082885 0.103646 0.119397 0.102779 0.100221 0.089367 0.083470 0.126716 0.124357
qa: -0.3585 -0.3157 0.4062 0.3397 0.0438 -0.3163 -0.2411 -0.2114 0.0134 -0.2773 -0.2718 -0.2921 0.0014 -0.0246 0.0065 -0.1676 -0.1107 -0.2397 -0.1367 -0.1177 0.0489 0.0879 0.0894 0.0752 0.0852 0.0821 0.0709 0.0315 0.0763 0.0976 0.0847 0.1056 0.0605 0.0843 0.0872 0.0815 0.0885 0.0829 0.1036 0.1194 0.1028 0.1002 0.0894 0.0835 0.1267 0.1244
va: 2.1100 1.9962 3.7149 3.7547 4.0710 4.0426 3.9826 3.9646 3.7689 3.9151 3.9522 3.9481 3.9614 3.5436 3.6835 3.9431 3.9475 3.9163 3.9383 3.9600 1.0143 1.0212 1.0125 1.0152 1.0177 1.0146 1.0189 1.0228 1.0046 1.0209 1.0104 1.0188 1.0065 1.0055 1.0038 1.0016 1.0075 0.9995 0.9929 1.0160 1.0097 0.9945 0.9947 1.0115 0.9999 0.9996
dispcorr: -0.025177839 hartree
energy: -852.125097090904
dipole: 6.85833 -7.16629 -0.30795 4.88508 -5.04197 -0.15689 5.94149 -5.04907 0.89242
magnitude: 0.95701 au
magnitude: 2.43253 debye
