program: Orca
programVersion: 5.0.2
elementType: O O O O O C C C C C C C C H H H H H H H H H H
charge: 0
multiplicity: 1
keywords: wb97x-d3
keywords: def2-TZVPP
keywords: def2/J RIJCOSX
keywords: DEFGRID2
keywords: scfconv7
keywords: smallprint printgap noloewdin
keywords: NOSOSCF
formula: C8H10O5
InChI: InChI=1/C8H10O5/c9-7(10)5-3-1-2-4(13-3)6(5)8(11)12/h3-6,9,11H,1-2H2
23 atoms
O  -0.372352 1.585383 1.12112
O  -3.01828 -0.415398 -0.748154
O  2.544277 -1.517221 0.652664
O  -2.098978 -1.579364 0.914557
O  1.650422 -1.445515 -1.390214
C  -0.788632 1.434277 -0.232012
C  0.896014 0.956373 0.989529
C  -0.722018 -0.099451 -0.417608
C  0.479193 -0.44711 0.471791
C  0.350681 2.085996 -1.022903
C  1.561825 1.775053 -0.118839
C  -1.993514 -0.784231 0.01138
C  1.592255 -1.184874 -0.212012
H  -1.768339 1.882398 -0.384518
H  1.419305 0.939243 1.943272
H  -0.560241 -0.352702 -1.4682
H  0.167212 -1.045775 1.330989
H  0.183728 3.158673 -1.118028
H  0.443992 1.674184 -2.027012
H  2.365993 1.249371 -0.632563
H  1.994363 2.683823 0.299862
H  -3.828919 -0.862392 -0.457709
H  3.270878 -1.969641 0.195435
elementType: O C H
totalener: -687.13707393 hartree
nucrepener: 875.08521882 hartree
electener: -1562.22229275 hartree
oneelecener: -2676.60719603 hartree
twoeener: 1114.38490329 hartree
cpcmener: -0.03938280 hartree
kineticenergy: 684.31678579 hartree
xcener: -62.710949604025 hartree
chargesum: -0.0000000
charge: -0.415391 -0.303007 -0.300370 -0.458744 -0.457220 0.152007 0.171478 -0.039742 -0.102218 -0.181647 -0.177160 0.382848 0.387085 0.129865 0.135290 0.101107 0.101945 0.092800 0.083540 0.080437 0.090519 0.262319 0.264258
qa: -0.4154 -0.3030 -0.3004 -0.4587 -0.4572 0.1520 0.1715 -0.0397 -0.1022 -0.1816 -0.1772 0.3828 0.3871 0.1299 0.1353 0.1011 0.1019 0.0928 0.0835 0.0804 0.0905 0.2623 0.2643
va: 2.0084 2.1920 2.1976 2.0277 2.0235 3.9803 3.9573 3.7912 3.9497 3.9916 3.9616 4.2680 4.2886 1.0058 0.9928 1.0558 1.0633 1.0111 1.0191 1.0245 1.0114 0.9898 0.9881
dispcorr: -0.010554391 hartree
energy: -687.147628320072
dipole: 3.46495 -2.94722 0.51773 6.93683 -6.32736 0.60947 -2.17148 1.63560 -0.53588
magnitude: 0.96263 au
magnitude: 2.44681 debye
