program: Orca
programVersion: 5.0.2
elementType: Cl O O O N N C C C C C C C C C C C C H H H H H H H H H
charge: 0
multiplicity: 1
keywords: wb97x-d3
keywords: def2-TZVPP
keywords: def2/J RIJCOSX
keywords: DEFGRID2
keywords: scfconv7
keywords: smallprint printgap noloewdin
keywords: NOSOSCF
formula: C12H9ClN2O3
InChI: InChI=1/C12H9ClN2O3/c13-11-10(18-8-4-2-1-3-5-8)7-6-9(12(11)14)15(16)17/h1-7H,14H2
27 atoms
Cl -0.492702 -2.763533 -0.419226
O  1.506823 -0.887619 0.270764
O  -4.535267 0.736178 -0.089168
O  -3.610042 2.589422 0.412955
N  -3.108011 -1.44551 -0.404298
N  -3.552833 1.408652 0.169638
C  0.301982 -0.293734 0.237231
C  -2.105717 -0.609862 -0.101973
C  -2.262799 0.770321 0.183982
C  -0.779533 -1.097755 -0.0685
C  0.109473 1.06073 0.5284
C  -1.162229 1.567628 0.495837
C  2.642809 -0.146486 0.060912
C  2.807741 0.590735 -1.10291
C  3.642644 -0.206786 1.016444
C  3.991586 1.282637 -1.300793
C  4.826559 0.483261 0.801019
C  5.003259 1.232303 -0.352035
H  0.944948 1.695141 0.785813
H  -1.322537 2.61041 0.723781
H  2.022696 0.620011 -1.84778
H  3.49428 -0.793854 1.913004
H  -2.913633 -2.41155 -0.589956
H  -4.050072 -1.102274 -0.434737
H  4.124458 1.859572 -2.206162
H  5.612475 0.435419 1.54282
H  5.926782 1.771013 -0.514341
totalener: -1258.05943424 hartree
nucrepener: 1371.71059004 hartree
electener: -2629.77002427 hartree
oneelecener: -4445.49608107 hartree
twoeener: 1815.72605680 hartree
kineticenergy: 1254.27144901 hartree
xcener: -96.053188249433 hartree
chargesum: 0.0000000
charge: -0.072865 -0.286155 -0.383751 -0.350310 -0.244805 0.508909 0.234671 0.137679 -0.094386 -0.029489 -0.182240 -0.049848 0.212265 -0.149026 -0.182188 -0.118618 -0.102811 -0.128219 0.137543 0.149962 0.137102 0.130445 0.148413 0.188127 0.130882 0.129091 0.129623
qa: -0.0729 -0.2862 -0.3838 -0.3503 -0.2448 0.5089 0.2347 0.1377 -0.0944 -0.0295 -0.1822 -0.0498 0.2123 -0.1490 -0.1822 -0.1186 -0.1028 -0.1282 0.1375 0.1500 0.1371 0.1304 0.1484 0.1881 0.1309 0.1291 0.1296
va: 1.2687 2.1277 1.8484 1.9115 3.2617 4.1552 3.9106 4.0534 3.9538 3.9018 3.9550 4.0204 3.8242 3.9782 4.0291 3.9519 3.9390 3.9528 1.0049 1.0248 1.0011 1.0109 1.0588 1.0469 0.9994 0.9990 0.9994
dispcorr: -0.011345335 hartree
energy: -1258.070779573070
dipole: 13.47371 -11.97078 1.50292 8.11556 -8.55471 -0.43915 0.10296 -0.23980 -0.13684
magnitude: 1.57174 au
magnitude: 3.99503 debye
