program: Orca
programVersion: 5.0.2
elementType: Cl O O O O N N N C C C C C C C C C C C C C C C C C C C H H H H H H H H H H H H H H H H H H H H
charge: 0
multiplicity: 1
keywords: wb97x-d3
keywords: def2-TZVPP
keywords: def2/J RIJCOSX
keywords: DEFGRID2
keywords: scfconv7
keywords: smallprint printgap noloewdin
keywords: NOSOSCF
formula: C19H20ClN3O4
InChI: InChI=1/C19H20ClN3O4/c1-12-3-2-4-14(13-5-6-13)17(12)27-18-15(11-16(20)21-22-18)26-19(24)23-7-9-25-10-8-23/h2-4,11,13H,5-10H2,1H3
47 atoms
Cl -5.176834 0.103262 1.199219
O  0.247466 -0.398195 -0.368006
O  3.828178 2.344974 -0.655527
O  -0.560764 2.038512 0.405058
O  -0.5132 2.079217 -1.841795
N  1.117564 3.119378 -0.627434
N  -1.834569 -1.30112 -0.023935
N  -3.096524 -1.163323 0.347919
C  1.25137 -1.642221 1.894425
C  1.390678 -2.414947 3.166799
C  0.055372 -1.863601 2.780922
C  1.337391 -2.295766 0.561749
C  0.801823 -1.6552 -0.551842
C  1.963396 -3.519826 0.34952
C  0.870864 -2.158424 -1.843321
C  2.039518 -4.063904 -0.924524
C  1.504837 -3.387174 -2.009629
C  0.29575 -1.405138 -3.003403
C  1.956413 3.373112 -1.795457
C  1.907527 3.129268 0.602855
C  3.063534 2.337484 -1.84567
C  3.032029 2.116083 0.490349
C  -1.030668 -0.275522 -0.012723
C  0.012837 2.383345 -0.793601
C  -1.449294 1.016438 0.364998
C  -2.745317 1.168739 0.747222
C  -3.526346 0.00741 0.721419
H  1.653768 -0.633894 1.918373
H  1.524645 -3.487796 3.114516
H  1.928932 -1.942273 3.977818
H  -0.33746 -1.013056 3.322922
H  -0.694869 -2.566415 2.442659
H  2.40294 -4.048101 1.185441
H  2.533774 -5.014848 -1.073582
H  1.581433 -3.810123 -3.003554
H  0.531275 -1.909403 -3.939591
H  0.689329 -0.389013 -3.064656
H  -0.791763 -1.328358 -2.935855
H  1.367392 3.3506 -2.708242
H  2.375906 4.376007 -1.698603
H  2.314024 4.134636 0.726015
H  1.296874 2.919949 1.475802
H  2.627993 1.343308 -2.021348
H  3.742739 2.556789 -2.670243
H  2.610289 1.101541 0.47355
H  3.684809 2.192393 1.360753
H  -3.140549 2.125504 1.059538
elementType: Cl O N C H
totalener: -1661.49939450 hartree
nucrepener: 2787.40766960 hartree
electener: -4448.90706410 hartree
oneelecener: -7815.31292990 hartree
twoeener: 3366.40586580 hartree
cpcmener: -0.04207002 hartree
kineticenergy: 1655.78026131 hartree
xcener: -135.696406426441 hartree
chargesum: 0.0000000
charge: -0.054776 -0.281926 -0.402130 -0.323532 -0.502263 -0.123345 -0.122470 -0.243669 -0.080218 -0.176139 -0.159146 0.051888 0.139639 -0.158915 -0.049243 -0.152872 -0.159482 -0.236909 -0.062192 -0.053035 0.035108 0.027709 0.260905 0.440944 0.193555 -0.140555 0.159676 0.106372 0.090337 0.096851 0.092149 0.085809 0.144819 0.158712 0.142927 0.102631 0.095681 0.105729 0.102708 0.105961 0.106978 0.108173 0.080939 0.111363 0.069187 0.112244 0.153825
qa: -0.0548 -0.2819 -0.4021 -0.3235 -0.5023 -0.1233 -0.1225 -0.2437 -0.0802 -0.1761 -0.1591 0.0519 0.1396 -0.1589 -0.0492 -0.1529 -0.1595 -0.2369 -0.0622 -0.0530 0.0351 0.0277 0.2609 0.4409 0.1936 -0.1406 0.1597 0.1064 0.0903 0.0969 0.0921 0.0858 0.1448 0.1587 0.1429 0.1026 0.0957 0.1057 0.1027 0.1060 0.1070 0.1082 0.0809 0.1114 0.0692 0.1122 0.1538
va: 1.2471 2.0838 1.9255 2.0918 1.9964 3.1804 2.8754 2.9445 3.7232 3.9495 3.8928 3.6670 3.7447 3.8912 3.8191 3.9133 3.8873 3.9042 3.8515 3.8469 3.9250 3.9563 4.0626 4.3202 3.9067 4.0550 4.1803 1.0066 1.0189 1.0168 1.0189 1.0220 1.0033 0.9904 1.0007 1.0075 1.0049 1.0010 1.0315 1.0105 1.0081 1.0240 1.0046 0.9996 1.0218 1.0015 1.0051
dispcorr: -0.028080461 hartree
energy: -1661.527474963214
dipole: 33.50202 -31.58173 1.92029 -1.86746 3.75825 1.89079 -2.84342 3.90625 1.06283
magnitude: 2.89693 au
magnitude: 7.36342 debye
