program: Orca
programVersion: 5.0.2
elementType: Cl O O O O N N N C C C C C C C C C C C C C C C C C C C H H H H H H H H H H H H H H H H H H H H
charge: 0
multiplicity: 1
keywords: wb97x-d3
keywords: def2-TZVPP
keywords: def2/J RIJCOSX
keywords: DEFGRID2
keywords: scfconv7
keywords: smallprint printgap noloewdin
keywords: NOSOSCF
formula: C19H20ClN3O4
InChI: InChI=1/C19H20ClN3O4/c1-12-3-2-4-14(13-5-6-13)17(12)27-18-15(11-16(20)21-22-18)26-19(24)23-7-9-25-10-8-23/h2-4,11,13H,5-10H2,1H3
47 atoms
Cl -4.999558 0.623252 0.660811
O  0.155911 -1.22808 -0.800601
O  3.356284 4.723164 -1.08113
O  -0.124115 1.384789 -0.613933
O  -0.100057 2.270578 1.460256
N  1.414707 2.921868 -0.11328
N  -2.037289 -1.613544 -0.257811
N  -3.232105 -1.165445 0.083178
C  0.59618 -2.226316 1.804212
C  1.506053 -1.052609 2.015774
C  1.626901 -2.262527 2.888932
C  0.730274 -3.082958 0.595487
C  0.451886 -2.576752 -0.670574
C  1.110097 -4.418832 0.680405
C  0.537612 -3.329117 -1.835397
C  1.205453 -5.202506 -0.459604
C  0.924495 -4.660159 -1.704859
C  0.233575 -2.722774 -3.171427
C  2.173785 3.761717 0.80519
C  2.088837 2.677782 -1.385015
C  2.634459 5.018797 0.096762
C  2.55202 3.991121 -1.981481
C  -1.050279 -0.781553 -0.449584
C  0.380309 2.216043 0.349552
C  -1.195864 0.613015 -0.326478
C  -2.424899 1.085279 0.024609
C  -3.416143 0.117222 0.214102
H  -0.427121 -2.083531 2.139463
H  2.28783 -0.880962 1.286515
H  1.077063 -0.151033 2.432775
H  1.283348 -2.19706 3.912951
H  2.490584 -2.900248 2.748393
H  1.332709 -4.843304 1.651321
H  1.502708 -6.239713 -0.378454
H  1.002026 -5.275575 -2.592536
H  -0.778542 -2.316676 -3.212005
H  0.321588 -3.46914 -3.95894
H  0.917079 -1.907245 -3.411656
H  1.558676 4.042549 1.65654
H  3.036128 3.203836 1.182162
H  2.944779 2.016773 -1.219833
H  1.425888 2.193663 -2.09553
H  1.769107 5.653774 -0.13197
H  3.294557 5.579848 0.758075
H  1.682081 4.584904 -2.290513
H  3.151247 3.787261 -2.869272
H  -2.631644 2.140584 0.133675
elementType: Cl O N C H
totalener: -1661.49908736 hartree
nucrepener: 2688.44971149 hartree
electener: -4349.94879885 hartree
oneelecener: -7617.37345193 hartree
twoeener: 3267.42465308 hartree
cpcmener: -0.04139707 hartree
kineticenergy: 1655.78179811 hartree
xcener: -135.697087876654 hartree
chargesum: 0.0000000
charge: -0.055405 -0.318118 -0.393929 -0.322929 -0.523129 -0.112316 -0.127653 -0.249989 -0.026628 -0.183009 -0.178696 0.047130 0.138858 -0.204683 -0.034057 -0.143924 -0.163428 -0.236117 -0.060296 -0.069057 0.016046 0.021691 0.287052 0.485696 0.167763 -0.116223 0.152138 0.101423 0.094746 0.089926 0.095681 0.092927 0.147654 0.158853 0.141877 0.103712 0.098047 0.109484 0.105747 0.109422 0.105232 0.110371 0.085391 0.104276 0.085717 0.105434 0.157298
qa: -0.0554 -0.3181 -0.3939 -0.3229 -0.5231 -0.1123 -0.1277 -0.2500 -0.0266 -0.1830 -0.1787 0.0471 0.1389 -0.2047 -0.0341 -0.1439 -0.1634 -0.2361 -0.0603 -0.0691 0.0160 0.0217 0.2871 0.4857 0.1678 -0.1162 0.1521 0.1014 0.0947 0.0899 0.0957 0.0929 0.1477 0.1589 0.1419 0.1037 0.0980 0.1095 0.1057 0.1094 0.1052 0.1104 0.0854 0.1043 0.0857 0.1054 0.1573
va: 1.2465 2.1189 1.9216 2.1111 1.9832 3.2073 2.8652 2.9541 3.6793 3.8788 3.9419 3.6307 3.7215 3.9396 3.8023 3.8916 3.9024 3.9177 3.8488 3.8774 3.9601 3.9370 4.0653 4.2174 3.9579 4.0325 4.1890 1.0098 1.0173 1.0371 1.0172 1.0173 0.9995 0.9900 1.0007 1.0001 1.0046 0.9952 1.0268 1.0059 1.0061 1.0196 1.0052 0.9980 1.0066 0.9978 1.0052
dispcorr: -0.024895241 hartree
energy: -1661.523982596791
dipole: 33.32995 -31.38036 1.94959 0.81130 0.81754 1.62884 -3.48092 2.24528 -1.23564
magnitude: 2.82504 au
magnitude: 7.18067 debye
