program: Orca
programVersion: 5.0.2
elementType: Cl O O O O N N N C C C C C C C C C C C C C C C C C C C H H H H H H H H H H H H H H H H H H H H
charge: 0
multiplicity: 1
keywords: wb97x-d3
keywords: def2-TZVPP
keywords: def2/J RIJCOSX
keywords: DEFGRID2
keywords: scfconv7
keywords: smallprint printgap noloewdin
keywords: NOSOSCF
formula: C19H20ClN3O4
InChI: InChI=1/C19H20ClN3O4/c1-12-3-2-4-14(13-5-6-13)17(12)27-18-15(11-16(20)21-22-18)26-19(24)23-7-9-25-10-8-23/h2-4,11,13H,5-10H2,1H3
47 atoms
Cl -5.143389 0.222975 1.155541
O  0.267616 -0.418557 -0.424616
O  3.54132 2.693291 -1.888027
O  -0.696377 2.114026 -0.347981
O  0.567293 1.900598 1.498826
N  1.28195 3.160809 -0.266678
N  -1.768268 -1.284398 0.174956
N  -3.027219 -1.119637 0.540908
C  1.013838 -1.759368 1.942936
C  1.424861 -2.436097 3.215313
C  -0.024623 -2.305041 2.889646
C  1.192213 -2.380469 0.606656
C  0.780094 -1.705322 -0.540417
C  1.746233 -3.646015 0.425297
C  0.904309 -2.217023 -1.826231
C  1.873417 -4.194889 -0.841056
C  1.464355 -3.483931 -1.958456
C  0.455991 -1.429172 -3.019186
C  2.630242 3.34231 0.261596
C  1.233741 3.411882 -1.70547
C  3.58997 2.444244 -0.496632
C  2.238044 2.517635 -2.407413
C  -1.0054 -0.253764 -0.061218
C  0.440351 2.347961 0.379707
C  -1.474955 1.072365 0.028543
C  -2.768373 1.252277 0.411866
C  -3.501136 0.087488 0.659458
H  1.113235 -0.681193 1.956556
H  1.870352 -3.421347 3.176456
H  1.835447 -1.800692 3.989122
H  -0.628042 -1.597297 3.443201
H  -0.55063 -3.198202 2.577351
H  2.087235 -4.212412 1.281564
H  2.306917 -5.179547 -0.956674
H  1.57447 -3.91288 -2.946535
H  1.004964 -0.490872 -3.113231
H  -0.604805 -1.177612 -2.968603
H  0.616009 -1.997664 -3.93374
H  2.906881 4.390545 0.133892
H  2.662441 3.121489 1.325023
H  0.239135 3.251781 -2.109786
H  1.484337 4.462081 -1.86679
H  4.612363 2.63187 -0.166984
H  3.352357 1.392825 -0.283535
H  2.27291 2.764876 -3.469006
H  1.921403 1.469288 -2.31427
H  -3.203564 2.238024 0.501397
elementType: Cl O N C H
totalener: -1661.49923680 hartree
nucrepener: 2765.24271852 hartree
electener: -4426.74195532 hartree
oneelecener: -7771.28905558 hartree
twoeener: 3344.54710026 hartree
cpcmener: -0.04173932 hartree
kineticenergy: 1655.77813532 hartree
xcener: -135.697213134350 hartree
chargesum: 0.0000000
charge: -0.054928 -0.306435 -0.400358 -0.322886 -0.509211 -0.127094 -0.126677 -0.250780 -0.074770 -0.173740 -0.155582 0.068494 0.135116 -0.203989 -0.036039 -0.144896 -0.167233 -0.246016 -0.061442 -0.056517 0.028527 0.028457 0.312027 0.456655 0.161748 -0.134053 0.155755 0.114542 0.088668 0.098655 0.090639 0.087055 0.149513 0.158708 0.143642 0.111144 0.105054 0.102186 0.106445 0.101102 0.107527 0.106835 0.109750 0.086069 0.111592 0.072278 0.154463
qa: -0.0549 -0.3064 -0.4004 -0.3229 -0.5092 -0.1271 -0.1267 -0.2508 -0.0748 -0.1737 -0.1556 0.0685 0.1351 -0.2040 -0.0360 -0.1449 -0.1672 -0.2460 -0.0614 -0.0565 0.0285 0.0285 0.3120 0.4567 0.1617 -0.1341 0.1558 0.1145 0.0887 0.0987 0.0906 0.0871 0.1495 0.1587 0.1436 0.1111 0.1051 0.1022 0.1064 0.1011 0.1075 0.1068 0.1097 0.0861 0.1116 0.0723 0.1545
va: 1.2470 2.0853 1.9249 2.0954 1.9920 3.1905 2.8814 2.9414 3.6732 3.9566 3.9022 3.6632 3.7701 3.9056 3.8206 3.9115 3.8940 3.9162 3.8542 3.8505 3.9192 3.9570 4.0415 4.2914 3.9202 4.0349 4.1877 1.0120 1.0211 1.0150 1.0195 1.0192 1.0055 0.9907 1.0001 0.9924 0.9978 1.0056 1.0095 1.0329 1.0254 1.0081 0.9986 1.0035 1.0000 1.0228 1.0047
dispcorr: -0.026844571 hartree
energy: -1661.526081373076
dipole: 32.10156 -30.99486 1.10670 -2.25507 4.30889 2.05382 -6.88501 5.45822 -1.42680
magnitude: 2.73472 au
magnitude: 6.95111 debye
