program: Orca
programVersion: 5.0.2
elementType: Cl O O O O N N N C C C C C C C C C C C C C C C C C C C H H H H H H H H H H H H H H H H H H H H
charge: 0
multiplicity: 1
keywords: wb97x-d3
keywords: def2-TZVPP
keywords: def2/J RIJCOSX
keywords: DEFGRID2
keywords: scfconv7
keywords: smallprint printgap noloewdin
keywords: NOSOSCF
formula: C19H20ClN3O4
InChI: InChI=1/C19H20ClN3O4/c1-12-3-2-4-14(13-5-6-13)17(12)27-18-15(11-16(20)21-22-18)26-19(24)23-7-9-25-10-8-23/h2-4,11,13H,5-10H2,1H3
47 atoms
Cl -5.396024 0.324445 0.803458
O  0.116361 -0.415393 -0.289512
O  3.660276 2.165389 -1.218985
O  -0.798278 2.104053 -0.369644
O  0.190753 1.951723 1.640625
N  1.229177 3.03297 -0.081594
N  -1.955857 -1.250744 0.232899
N  -3.240729 -1.057087 0.481851
C  1.534838 -1.556868 1.860394
C  2.912144 -1.432276 2.463164
C  1.890694 -2.296021 3.119102
C  1.355699 -2.265087 0.568949
C  0.625581 -1.694524 -0.469393
C  1.9402 -3.507927 0.317803
C  0.457975 -2.290906 -1.717042
C  1.786781 -4.134428 -0.906028
C  1.053323 -3.530318 -1.917327
C  -0.315124 -1.613901 -2.807812
C  2.487922 3.170104 0.645856
C  1.442244 3.099959 -1.526714
C  3.453413 2.097587 0.178637
C  2.450388 2.042451 -1.940349
C  -1.176996 -0.237597 -0.022648
C  0.248576 2.323703 0.489135
C  -1.638185 1.094638 -0.035014
C  -2.955456 1.304077 0.227525
C  -3.715381 0.154907 0.475771
H  0.898757 -0.695549 2.009652
H  3.72673 -1.916358 1.938541
H  3.172478 -0.489281 2.926536
H  1.433306 -1.946037 4.035245
H  2.015623 -3.370135 3.070836
H  2.525393 -3.994874 1.087687
H  2.250187 -5.097152 -1.07724
H  0.94527 -4.020304 -2.87687
H  -0.202678 -2.156125 -3.745063
H  0.022491 -0.58969 -2.973734
H  -1.382987 -1.570231 -2.585038
H  2.890716 4.163146 0.438632
H  2.32514 3.099429 1.718021
H  0.514613 2.972422 -2.076659
H  1.822328 4.096406 -1.758585
H  4.423118 2.234396 0.658716
H  3.068827 1.108273 0.466378
H  2.688843 2.155985 -2.998632
H  2.01457 1.044287 -1.798653
H  -3.387566 2.295192 0.230828
elementType: Cl O N C H
totalener: -1661.50003216 hartree
nucrepener: 2776.06641273 hartree
electener: -4437.56644488 hartree
oneelecener: -7792.68348484 hartree
twoeener: 3355.11703995 hartree
cpcmener: -0.04201435 hartree
kineticenergy: 1655.76843743 hartree
xcener: -135.695104805310 hartree
chargesum: -0.0000000
charge: -0.054295 -0.282533 -0.402613 -0.323214 -0.504091 -0.119730 -0.124883 -0.247117 -0.068891 -0.171660 -0.162286 0.068307 0.078216 -0.208087 0.012888 -0.148833 -0.178389 -0.222139 -0.062376 -0.061233 0.044168 0.034847 0.271393 0.442966 0.196815 -0.143068 0.160822 0.105287 0.091920 0.096400 0.097949 0.087296 0.141340 0.158614 0.141777 0.101528 0.107381 0.103890 0.106932 0.103271 0.108472 0.106923 0.113108 0.069265 0.110444 0.068009 0.155210
qa: -0.0543 -0.2825 -0.4026 -0.3232 -0.5041 -0.1197 -0.1249 -0.2471 -0.0689 -0.1717 -0.1623 0.0683 0.0782 -0.2081 0.0129 -0.1488 -0.1784 -0.2221 -0.0624 -0.0612 0.0442 0.0348 0.2714 0.4430 0.1968 -0.1431 0.1608 0.1053 0.0919 0.0964 0.0979 0.0873 0.1413 0.1586 0.1418 0.1015 0.1074 0.1039 0.1069 0.1033 0.1085 0.1069 0.1131 0.0693 0.1104 0.0680 0.1552
va: 1.2475 2.0805 1.9251 2.0917 1.9941 3.1814 2.8856 2.9601 3.7151 3.8998 3.9342 3.6030 3.7968 3.8844 3.8142 3.9222 3.9161 3.8970 3.8491 3.8607 3.9394 3.9394 4.0564 4.3110 3.9220 4.0579 4.1877 1.0169 1.0174 1.0179 1.0166 1.0200 1.0051 0.9906 1.0011 1.0046 0.9976 1.0007 1.0103 1.0309 1.0231 1.0083 0.9989 1.0139 1.0009 1.0135 1.0048
dispcorr: -0.027432965 hartree
energy: -1661.527465121933
dipole: 36.97643 -35.50787 1.46856 -2.87779 4.81881 1.94102 -5.00256 3.49846 -1.50410
magnitude: 2.86121 au
magnitude: 7.27262 debye
