program: Orca
programVersion: 5.0.2
elementType: Cl O O O O N N N C C C C C C C C C C C C C C C C C C C H H H H H H H H H H H H H H H H H H H H
charge: 0
multiplicity: 1
keywords: wb97x-d3
keywords: def2-TZVPP
keywords: def2/J RIJCOSX
keywords: DEFGRID2
keywords: scfconv7
keywords: smallprint printgap noloewdin
keywords: NOSOSCF
formula: C19H20ClN3O4
InChI: InChI=1/C19H20ClN3O4/c1-12-3-2-4-14(13-5-6-13)17(12)27-18-15(11-16(20)21-22-18)26-19(24)23-7-9-25-10-8-23/h2-4,11,13H,5-10H2,1H3
47 atoms
Cl -5.346148 0.370668 0.72145
O  0.152971 -0.571624 -0.299997
O  3.753035 3.027988 -1.593908
O  -0.701986 1.99052 -0.476507
O  0.346124 1.842122 1.503382
N  1.296085 2.969642 -0.233821
N  -1.963492 -1.321655 0.153071
N  -3.241627 -1.085347 0.38842
C  0.602371 -2.190738 2.002886
C  1.454216 -1.135718 2.64383
C  1.51288 -2.5468 3.136352
C  0.885944 -2.665504 0.622312
C  0.605391 -1.870143 -0.484216
C  1.418431 -3.928308 0.379464
C  0.834338 -2.271279 -1.795597
C  1.661903 -4.36274 -0.91407
C  1.373595 -3.539575 -1.990892
C  0.521302 -1.367347 -2.948544
C  2.523371 3.29989 0.474279
C  1.346376 3.314942 -1.647705
C  3.699969 2.65498 -0.234054
C  2.571057 2.676326 -2.277364
C  -1.138461 -0.337903 -0.073222
C  0.354308 2.237287 0.360489
C  -1.556042 1.008733 -0.110537
C  -2.869202 1.261885 0.141531
C  -3.671279 0.14289 0.392062
H  -0.454297 -2.144984 2.248285
H  2.302162 -0.761767 2.083554
H  0.961751 -0.394951 3.259569
H  1.060088 -2.779127 4.091769
H  2.405444 -3.119954 2.918254
H  1.641691 -4.576589 1.217186
H  2.080014 -5.346685 -1.08285
H  1.566514 -3.881404 -3.000325
H  -0.540832 -1.11875 -2.995131
H  0.786582 -1.843195 -3.891519
H  1.069918 -0.425216 -2.889282
H  2.638034 4.387265 0.48845
H  2.472803 2.956166 1.504328
H  0.453501 2.987391 -2.171575
H  1.400439 4.403628 -1.734679
H  4.632547 2.978881 0.229864
H  3.633682 1.56262 -0.132753
H  2.674311 3.019821 -3.307801
H  2.442358 1.584589 -2.296545
H  -3.267486 2.267219 0.128934
elementType: Cl O N C H
totalener: -1661.50410609 hartree
nucrepener: 2747.79728598 hartree
electener: -4409.30139207 hartree
oneelecener: -7736.33417231 hartree
twoeener: 3327.03278024 hartree
cpcmener: -0.03565801 hartree
kineticenergy: 1655.80926761 hartree
xcener: -135.700769108420 hartree
chargesum: 0.0000000
charge: -0.055079 -0.289272 -0.381094 -0.330046 -0.487855 -0.114392 -0.128294 -0.245567 -0.069144 -0.172015 -0.182651 0.050476 0.130847 -0.165517 -0.030975 -0.150651 -0.155103 -0.234646 -0.069043 -0.076502 0.027971 0.023078 0.330396 0.452015 0.150499 -0.139397 0.155391 0.099413 0.092934 0.089225 0.092963 0.087894 0.144746 0.155329 0.138806 0.106716 0.099782 0.095123 0.107227 0.102901 0.108233 0.106619 0.103976 0.082855 0.104492 0.085550 0.151782
qa: -0.0551 -0.2893 -0.3811 -0.3300 -0.4879 -0.1144 -0.1283 -0.2456 -0.0691 -0.1720 -0.1827 0.0505 0.1308 -0.1655 -0.0310 -0.1507 -0.1551 -0.2346 -0.0690 -0.0765 0.0280 0.0231 0.3304 0.4520 0.1505 -0.1394 0.1554 0.0994 0.0929 0.0892 0.0930 0.0879 0.1447 0.1553 0.1388 0.1067 0.0998 0.0951 0.1072 0.1029 0.1082 0.1066 0.1040 0.0829 0.1045 0.0856 0.1518
va: 1.2462 2.1134 1.9423 2.0882 2.0214 3.1871 2.8824 2.9459 3.6939 3.8882 3.9588 3.6183 3.7707 3.9047 3.8155 3.9165 3.9031 3.9255 3.8473 3.8640 3.9467 3.9628 4.0042 4.2753 3.9328 4.0397 4.1858 1.0166 1.0149 1.0267 1.0173 1.0183 1.0001 0.9915 1.0012 0.9973 1.0063 0.9983 1.0070 1.0343 1.0248 1.0067 0.9981 1.0054 0.9999 1.0109 1.0059
dispcorr: -0.026221610 hartree
energy: -1661.530327697628
dipole: 35.83403 -34.44387 1.39016 -0.89421 2.75629 1.86208 -5.20736 3.70356 -1.50380
magnitude: 2.76790 au
magnitude: 7.03545 debye
