program: Orca
programVersion: 5.0.2
elementType: Cl O O O O N N N C C C C C C C C C C C C C C C C C C C H H H H H H H H H H H H H H H H H H H H
charge: 0
multiplicity: 1
keywords: wb97x-d3
keywords: def2-TZVPP
keywords: def2/J RIJCOSX
keywords: DEFGRID2
keywords: scfconv7
keywords: smallprint printgap noloewdin
keywords: NOSOSCF
formula: C19H20ClN3O4
InChI: InChI=1/C19H20ClN3O4/c1-12-3-2-4-14(13-5-6-13)17(12)27-18-15(11-16(20)21-22-18)26-19(24)23-7-9-25-10-8-23/h2-4,11,13H,5-10H2,1H3
47 atoms
Cl -4.998748 0.413418 1.410302
O  0.079331 -0.709909 -0.852022
O  3.918384 2.900162 -0.745365
O  -0.543766 1.85997 -0.579265
O  0.006084 2.278394 1.562712
N  1.189816 3.209819 -0.147617
N  -1.91005 -1.394197 0.060183
N  -3.087761 -1.112479 0.584224
C  1.69876 -1.420911 1.258956
C  2.102308 -1.869013 2.626662
C  0.753619 -1.256552 2.417574
C  1.390883 -2.393888 0.176498
C  0.540822 -2.017768 -0.858809
C  1.925439 -3.677252 0.129883
C  0.197778 -2.848738 -1.917226
C  1.600926 -4.5397 -0.906998
C  0.748012 -4.128149 -1.919206
C  -0.727536 -2.390227 -3.00227
C  2.207108 3.782371 0.723509
C  1.636762 3.138252 -1.533777
C  3.485225 2.972936 0.596373
C  2.934858 2.350443 -1.595253
C  -1.104114 -0.434548 -0.305501
C  0.23322 2.442765 0.386654
C  -1.431919 0.926338 -0.160285
C  -2.643651 1.226502 0.381695
C  -3.441873 0.131765 0.731321
H  2.160383 -0.499637 0.91406
H  2.144461 -2.930446 2.836503
H  2.858117 -1.288177 3.139773
H  0.57222 -0.254788 2.784768
H  -0.106655 -1.913275 2.460653
H  2.603709 -4.002513 0.908395
H  2.024615 -5.535488 -0.931316
H  0.502106 -4.806083 -2.727508
H  -1.750614 -2.281521 -2.635779
H  -0.749856 -3.110406 -3.818905
H  -0.42819 -1.426939 -3.417562
H  2.378048 4.816538 0.414516
H  1.866099 3.798615 1.755624
H  0.889253 2.68198 -2.176184
H  1.793815 4.159216 -1.89007
H  4.284542 3.442833 1.171698
H  3.32104 1.966336 1.00782
H  3.334716 2.370884 -2.610354
H  2.73282 1.301227 -1.333724
H  -2.970659 2.246858 0.528726
elementType: Cl O N C H
totalener: -1661.50332129 hartree
nucrepener: 2753.87883538 hartree
electener: -4415.38215667 hartree
oneelecener: -7748.17197226 hartree
twoeener: 3332.78981559 hartree
cpcmener: -0.03377022 hartree
kineticenergy: 1655.78890763 hartree
xcener: -135.696174010744 hartree
chargesum: -0.0000000
charge: -0.055039 -0.307441 -0.377749 -0.332189 -0.492837 -0.127658 -0.117166 -0.236722 -0.059260 -0.174840 -0.166851 0.073445 0.128026 -0.181067 -0.000240 -0.137094 -0.181162 -0.231598 -0.058946 -0.065049 0.017319 0.028008 0.265956 0.455838 0.147952 -0.113594 0.152993 0.100639 0.088785 0.094699 0.087252 0.088307 0.141870 0.154946 0.137962 0.104628 0.099029 0.108450 0.104683 0.102118 0.107775 0.104159 0.105380 0.083155 0.103064 0.075539 0.154526
qa: -0.0550 -0.3074 -0.3777 -0.3322 -0.4928 -0.1277 -0.1172 -0.2367 -0.0593 -0.1748 -0.1669 0.0734 0.1280 -0.1811 -0.0002 -0.1371 -0.1812 -0.2316 -0.0589 -0.0650 0.0173 0.0280 0.2660 0.4558 0.1480 -0.1136 0.1530 0.1006 0.0888 0.0947 0.0873 0.0883 0.1419 0.1549 0.1380 0.1046 0.0990 0.1084 0.1047 0.1021 0.1078 0.1042 0.1054 0.0832 0.1031 0.0755 0.1545
va: 1.2457 2.1098 1.9378 2.0991 2.0153 3.1862 2.8605 2.9486 3.7456 3.9403 3.8855 3.6236 3.7484 3.9200 3.7927 3.9030 3.9270 3.8895 3.8479 3.8608 3.9408 3.9395 4.0982 4.2719 3.9332 4.0558 4.1769 0.9875 1.0200 1.0177 1.0325 1.0230 1.0037 0.9913 1.0022 1.0025 1.0047 0.9988 1.0083 1.0333 1.0265 1.0081 1.0017 1.0019 1.0018 1.0080 1.0035
dispcorr: -0.026925554 hartree
energy: -1661.530246841990
dipole: 32.59655 -31.13353 1.46302 -1.83737 3.54609 1.70872 -5.75287 4.36184 -1.39102
magnitude: 2.64482 au
magnitude: 6.72261 debye
