program: Orca
programVersion: 5.0.2
elementType: Cl O O O O N N N C C C C C C C C C C C C C C C C C C C H H H H H H H H H H H H H H H H H H H H
charge: 0
multiplicity: 1
keywords: wb97x-d3
keywords: def2-TZVPP
keywords: def2/J RIJCOSX
keywords: DEFGRID2
keywords: scfconv7
keywords: smallprint printgap noloewdin
keywords: NOSOSCF
formula: C19H20ClN3O4
InChI: InChI=1/C19H20ClN3O4/c1-12-3-2-4-14(13-5-6-13)17(12)27-18-15(11-16(20)21-22-18)26-19(24)23-7-9-25-10-8-23/h2-4,11,13H,5-10H2,1H3
47 atoms
Cl -5.386502 0.295558 0.837876
O  0.136997 -0.443892 -0.213362
O  3.915577 2.416794 -0.162379
O  -0.669006 2.068479 0.338059
O  -0.355464 2.012873 -1.886368
N  1.186095 2.98898 -0.516782
N  -1.982875 -1.270924 0.071677
N  -3.266167 -1.080267 0.320604
C  1.495843 -1.601737 1.948565
C  2.835432 -1.573517 2.640124
C  1.717146 -2.36377 3.225432
C  1.344326 -2.302485 0.648546
C  0.639584 -1.723909 -0.403543
C  1.922736 -3.550354 0.410286
C  0.491566 -2.319658 -1.654344
C  1.787828 -4.175568 -0.815924
C  1.080946 -3.56402 -1.840951
C  -0.264867 -1.651772 -2.761505
C  2.142411 3.257789 -1.582103
C  1.795326 3.082913 0.804826
C  3.325618 2.315937 -1.441053
C  2.991392 2.14848 0.8690
C  -1.159667 -0.261801 0.035085
C  0.061134 2.325361 -0.795325
C  -1.572002 1.066114 0.273137
C  -2.893436 1.272232 0.52486
C  -3.700136 0.128381 0.53197
H  0.912168 -0.697518 2.058351
H  3.649944 -2.110912 2.169601
H  3.129575 -0.650069 3.123306
H  1.227133 -1.985143 4.113363
H  1.767136 -3.444439 3.176348
H  2.487957 -4.042275 1.192242
H  2.24467 -5.143169 -0.978521
H  0.98564 -4.055057 -2.80162
H  0.019144 -0.606678 -2.886507
H  -1.341889 -1.677354 -2.583647
H  -0.08161 -2.159246 -3.707501
H  1.676082 3.138914 -2.557021
H  2.46901 4.297042 -1.494144
H  2.113069 4.117282 0.957717
H  1.08812 2.839231 1.592194
H  2.99719 1.285166 -1.637272
H  4.09267 2.569691 -2.174478
H  2.642754 1.10732 0.816643
H  3.513457 2.279376 1.818375
H  -3.28864 2.259931 0.720154
elementType: Cl O N C H
totalener: -1661.50466332 hartree
nucrepener: 2759.47574088 hartree
electener: -4420.98040420 hartree
oneelecener: -7759.28661253 hartree
twoeener: 3338.30620833 hartree
cpcmener: -0.03531011 hartree
kineticenergy: 1655.78080278 hartree
xcener: -135.697370553588 hartree
chargesum: 0.0000000
charge: -0.055136 -0.294080 -0.382450 -0.329833 -0.478665 -0.120250 -0.127126 -0.240658 -0.061365 -0.161952 -0.157734 0.074883 0.093341 -0.212900 0.020465 -0.147510 -0.176978 -0.233687 -0.064755 -0.069387 0.027262 0.038046 0.309049 0.434982 0.171883 -0.145191 0.157917 0.096300 0.088098 0.093419 0.095151 0.086001 0.136085 0.154313 0.137340 0.104995 0.104587 0.100502 0.101552 0.105749 0.106590 0.107631 0.083879 0.105468 0.064288 0.108574 0.151307
qa: -0.0551 -0.2941 -0.3825 -0.3298 -0.4787 -0.1203 -0.1271 -0.2407 -0.0614 -0.1620 -0.1577 0.0749 0.0933 -0.2129 0.0205 -0.1475 -0.1770 -0.2337 -0.0648 -0.0694 0.0273 0.0380 0.3090 0.4350 0.1719 -0.1452 0.1579 0.0963 0.0881 0.0934 0.0952 0.0860 0.1361 0.1543 0.1373 0.1050 0.1046 0.1005 0.1016 0.1057 0.1066 0.1076 0.0839 0.1055 0.0643 0.1086 0.1513
va: 1.2460 2.0849 1.9441 2.0810 2.0303 3.1820 2.8984 2.9527 3.7244 3.8962 3.9234 3.5984 3.8189 3.9066 3.7994 3.9332 3.9255 3.8812 3.8545 3.8580 3.9339 3.9666 4.0288 4.3193 3.9149 4.0457 4.1889 1.0140 1.0189 1.0189 1.0178 1.0207 1.0062 0.9921 1.0029 1.0093 1.0031 1.0057 1.0343 1.0079 1.0079 1.0250 1.0026 0.9984 1.0189 0.9995 1.0066
dispcorr: -0.026623000 hartree
energy: -1661.531286320567
dipole: 37.47878 -35.61055 1.86823 -2.79686 4.57270 1.77584 -0.54043 1.55081 1.01039
magnitude: 2.76854 au
magnitude: 7.03706 debye
