program: Orca
programVersion: 5.0.2
elementType: Cl O O O O N N N C C C C C C C C C C C C C C C C C C C H H H H H H H H H H H H H H H H H H H H
charge: 0
multiplicity: 1
keywords: wb97x-d3
keywords: def2-TZVPP
keywords: def2/J RIJCOSX
keywords: DEFGRID2
keywords: scfconv7
keywords: smallprint printgap noloewdin
keywords: NOSOSCF
formula: C19H20ClN3O4
InChI: InChI=1/C19H20ClN3O4/c1-12-3-2-4-14(13-5-6-13)17(12)27-18-15(11-16(20)21-22-18)26-19(24)23-7-9-25-10-8-23/h2-4,11,13H,5-10H2,1H3
47 atoms
Cl -5.244565 0.688839 0.517514
O  0.147604 -0.918022 -0.18492
O  3.439113 4.591232 -0.097071
O  -0.296662 1.711423 0.283986
O  0.191421 1.492103 -1.899366
N  1.688425 2.423377 -0.454587
N  -2.083743 -1.40195 -0.000907
N  -3.334566 -1.012011 0.168263
C  1.227543 -2.016128 2.098708
C  2.270208 -0.93847 2.147338
C  2.437681 -2.181256 2.963555
C  1.05112 -2.830469 0.86551
C  0.461735 -2.264979 -0.260702
C  1.448119 -4.160847 0.784853
C  0.266753 -2.951957 -1.45351
C  1.257677 -4.883691 -0.383049
C  0.677022 -4.282208 -1.488302
C  -0.358239 -2.304478 -2.65056
C  2.686373 2.738606 -1.464748
C  2.075298 2.845231 0.88402
C  3.031368 4.214172 -1.393395
C  2.439924 4.317758 0.85972
C  -1.113959 -0.5309 -0.014413
C  0.534668 1.850267 -0.796309
C  -1.331249 0.850468 0.170302
C  -2.618338 1.261654 0.332696
C  -3.589739 0.254832 0.319988
H  0.302021 -1.787386 2.619628
H  2.906608 -0.815422 1.279497
H  2.020643 -0.014672 2.653963
H  2.305443 -2.11531 4.035822
H  3.196814 -2.888747 2.653513
H  1.907355 -4.631929 1.644773
H  1.570972 -5.918329 -0.435635
H  0.540923 -4.849157 -2.401383
H  -1.445085 -2.260202 -2.553799
H  -0.136025 -2.872941 -3.552779
H  -0.004781 -1.28502 -2.805773
H  3.577386 2.131328 -1.28047
H  2.315074 2.492754 -2.4564
H  1.277919 2.680451 1.602108
H  2.937534 2.251557 1.201858
H  3.857823 4.430567 -2.07171
H  2.165582 4.80833 -1.716577
H  2.830889 4.612431 1.8346
H  1.538764 4.915039 0.663297
H  -2.869343 2.302881 0.482078
elementType: Cl O N C H
totalener: -1661.50429179 hartree
nucrepener: 2713.59906123 hartree
electener: -4375.10335302 hartree
oneelecener: -7667.76236451 hartree
twoeener: 3292.65901149 hartree
cpcmener: -0.03521958 hartree
kineticenergy: 1655.81375086 hartree
xcener: -135.702001999909 hartree
chargesum: 0.0000000
charge: -0.055958 -0.284193 -0.377247 -0.325607 -0.490194 -0.107371 -0.130271 -0.239473 -0.068645 -0.175635 -0.172873 0.004061 0.146384 -0.157717 -0.028005 -0.150742 -0.160760 -0.233366 -0.056428 -0.079791 0.012697 0.026182 0.322183 0.453917 0.156610 -0.141408 0.155471 0.104120 0.091686 0.090199 0.094075 0.089500 0.143352 0.154669 0.137332 0.104824 0.101660 0.104914 0.107203 0.102357 0.110545 0.098892 0.101761 0.084384 0.101457 0.084170 0.151079
qa: -0.0560 -0.2842 -0.3772 -0.3256 -0.4902 -0.1074 -0.1303 -0.2395 -0.0686 -0.1756 -0.1729 0.0041 0.1464 -0.1577 -0.0280 -0.1507 -0.1608 -0.2334 -0.0564 -0.0798 0.0127 0.0262 0.3222 0.4539 0.1566 -0.1414 0.1555 0.1041 0.0917 0.0902 0.0941 0.0895 0.1434 0.1547 0.1373 0.1048 0.1017 0.1049 0.1072 0.1024 0.1105 0.0989 0.1018 0.0844 0.1015 0.0842 0.1511
va: 1.2454 2.1187 1.9405 2.0845 2.0221 3.1788 2.9013 2.9513 3.7431 3.8795 3.9440 3.6854 3.7798 3.8957 3.8209 3.9155 3.9101 3.8811 3.8370 3.8532 3.9667 3.9604 4.0212 4.2586 3.9240 4.0410 4.1881 1.0067 1.0145 1.0187 1.0183 1.0178 1.0009 0.9915 1.0020 1.0035 1.0046 1.0097 1.0055 1.0357 1.0229 1.0045 0.9982 1.0030 0.9977 1.0058 1.0063
dispcorr: -0.025478471 hartree
energy: -1661.529770260265
dipole: 35.83032 -33.92559 1.90473 0.13299 1.57731 1.71029 0.42206 0.53036 0.95241
magnitude: 2.73133 au
magnitude: 6.94250 debye
