program: Gaussian 09
title: 000006306
version: EM64L-G09RevD.01
frameworkgroup: C1[X(C6H13NO2)]
method: RPBEPBE
basis: SDD
operation: Freq
keyword: #p
keyword: freq=noraman
keyword: PBEPBE/SDD
title: #p freq=noraman PBEPBE/SDD
converged: YES YES NO NO
title: Mulliken charges:
elementType: O O N C C C C C C H H H H H H H H H H H H H
charge: -0.414832 -0.234974 -0.578705 0.015933 -0.218399 -0.404108 -0.734891 -0.706940 0.128207 0.214555 0.251065 0.218533 0.212000 0.203539 0.248508 0.213754 0.208706 0.217620 0.215345 0.289235 0.278897 0.376953
chargesum: 0.00000
title: Mulliken charges with hydrogens summed into heavy atoms:
elementType: O O N C C C C C C
charge: -0.037879 -0.234974 -0.010574 0.230489 0.032666 0.026425 -0.069090 -0.065270 0.128207
polarizability: 8.23697649e+01 -2.88188619e+00 7.60880700e+01 -1.26510102e+00 -4.31543865e-01 7.55452437e+01
1716.lowfreq: -18.6847 -0.0005 -0.0005 0.0006 13.2703 13.8479 42.0943 61.2170 76.3631
frequency: 41.7645 61.1148 76.1962 151.2501 194.3593 203.4488 209.8338 235.4965 273.8125 308.0770 328.0458 400.7594 411.5889 549.9316 593.1913 626.9777 684.0342 704.2621 763.5658 794.2506 846.5175 923.6577 962.5664 983.9843 1025.4795 1037.0787 1061.0794 1089.1833 1151.1862 1176.4583 1190.6944 1228.8942 1270.3257 1279.9923 1301.4744 1335.9577 1347.1531 1366.6225 1373.8289 1392.3591 1468.3950 1471.3600 1479.3536 1485.0286 1488.7425 1649.7242 1654.4641 2967.6690 2976.7113 2979.2752 2984.7170 3023.3202 3030.4958 3069.4637 3071.6305 3078.2314 3090.8985 3458.7119 3499.1994 3577.3694
redmass: 5.1725 2.0060 3.7833 2.8109 1.8532 1.1020 1.3630 1.5704 2.3094 2.8014 3.2351 2.3858 3.7995 2.2152 2.6103 1.7116 1.7576 2.7167 1.7389 1.6317 2.7296 2.6256 1.2015 1.7606 2.2751 2.3201 1.9654 1.4530 1.9195 3.0409 1.7667 1.3261 1.3236 1.6005 1.3192 1.3895 1.4904 1.3452 1.2626 1.2052 1.0483 1.0593 1.0464 1.0762 1.0457 8.5263 1.0923 1.0591 1.0364 1.0428 1.0764 1.1002 1.0847 1.0989 1.0989 1.0994 1.0999 1.0454 1.0640 1.0966
irintensity: 0.5624 0.5235 0.7283 0.4757 7.9837 14.3423 24.3800 2.2719 8.7185 7.4399 8.6755 5.9553 26.6521 43.2828 18.4305 86.5785 230.7563 42.2744 1.6689 2.5598 7.1912 8.5849 8.3844 3.2711 155.9732 104.6286 14.5710 6.6779 2.3478 1.1048 1.1457 2.3229 2.6882 15.3986 6.1653 1.8698 1.9169 7.4921 13.3735 12.1089 12.1544 0.8220 8.7212 13.2492 11.0599 197.7000 62.9261 30.2989 32.6037 22.3411 21.4580 16.5092 16.1293 18.9198 74.4967 50.6351 23.7349 1.4170 12.1127 4.1327
temp: 298.150 k
press: 1.00000 atm
elementType: 8 8 7 6 6 6 6 6 6 1 1 1 1 1 1 1 1 1 1 1 1 1
symmnumber: 1
zpe: 493227.6 jmol-1
zpe.correction: 0.187860 hartree
zpe.thermalcorrener: 0.199213 hartree
zpe.thermalcorrenthalpy: 0.200157 hartree
zpe.thermalcorrgfe: 0.150638 hartree
zpe.sumelectzpe: -440.894233 hartree
zpe.sumelectthermal: -440.882881 hartree
zpe.sumelectthermalent: -440.881936 hartree
zpe.sumelectthermalfe: -440.931456 hartree
dipole: 0.3167 -0.0449 0.9634
dipole: 1.0151
quadrupole: -55.0775 -53.8413 -57.4540
quadrupole: 2.0298 3.6207 -2.6175
quadrupole: 0.3801 1.6163 -1.9964 2.0298 3.6207 -2.6175
hfenergy: -441.0820939 hartree
pointgroup: C01 [X(C6H13N1O2)]
dipole: 0.1038965 0.0216435 -0.3850278 debye
dipolederiv: -0.4208246 -0.0302537 0.2528805 -0.0482999 -0.4538135 0.3789816 0.228065 0.2965049 -1.0396372 -0.5811342 -0.1808492 -0.2342239 -0.2907036 -0.5065898 -0.1734252 -0.1126997 0.0196594 -0.840231 -0.5206307 -0.208 0.0000186 -0.1386381 -0.5490153 0.2059285 -0.05024 0.2515084 -0.4340091 0.2029976 0.07159 -0.0123866 -0.1061766 0.0280251 0.0091484 0.0443289 0.033429 0.11729 0.0091633 -0.1337255 0.028928 -0.0672744 0.3017219 -0.1678254 -0.0275008 -0.2987032 0.3260296 0.0017817 0.021301 -0.0329934 0.0506615 0.075233 -0.0505215 -0.0471341 -0.0264775 0.0542926 -0.0831615 -0.0846211 -0.0196523 0.013582 -0.0171547 -0.0054885 -0.0352589 -0.0510217 0.0433341 -0.0054941 0.0650033 -0.007916 0.0737826 0.0481587 -0.0065025 0.0290889 -0.0231865 0.068273 0.6344356 0.4044233 0.0619979 0.6348825 0.5814211 -0.079468 -0.0218909 -0.1870506 1.4100799 0.0491505 -0.0100104 0.0085828 -0.0141095 -0.058643 0.0987819 0.012271 0.0863388 -0.0746413 0.0674842 0.0411916 0.0458415 0.0392101 -0.0202736 -0.0691607 0.0613302 -0.049618 -0.0536209 -0.072429 -0.0929864 -0.0650606 -0.1005166 -0.0369248 -0.0612493 -0.0548085 -0.0532278 0.032634 0.0548858 0.0071621 0.0263302 -0.0133922 -0.0273754 0.1336487 0.0197306 0.0920005 -0.0696188 0.0606153 0.0466175 0.0940126 0.0145314 -0.0024329 -0.1095859 0.0501444 -0.1283694 -0.1044133 0.1285051 0.0105527 0.0012306 -0.0267024 -0.0037824 0.0595019 0.0387428 0.1270058 -0.0149789 -0.1858266 0.0429269 -0.0461199 0.060639 0.0682439 0.02412 -0.0391205 0.0132551 0.0936202 0.0561654 -0.0345358 0.0512316 0.0026744 -0.0156529 0.1092015 0.000564 0.1545017 -0.0698796 0.032839 0.0626494 0.0502 0.092775 -0.014067 -0.1125504 0.0850986 -0.1372179 -0.0723755 -0.0757596 -0.0907039 -0.0549655 -0.1455349 -0.004998 -0.0317674 -0.0812638 -0.0179162 0.0744731 0.3164019 0.042179 -0.0846749 0.034498 0.1506043 -0.1219549 -0.0150441 -0.0523836 0.1240643 0.0712625 0.2004868 -0.0302818 0.0844774 0.2569567 -0.0101597 0.0081473 0.0124163 0.1421783 0.2595726 -0.1503976 -0.0329793 -0.1503658 0.2003585 -0.019653 -0.0925504 -0.0614474 0.2871366 unknown
polarizability: 82.3123602|3.0342296|76.2624757|0.9227057|-0.5544641|75.4282427 unknown
InChI: InChI=1S/C6H13NO2/c1-3-4(2)5(7)6(8)9/h4-5,8H,3,7H2,1-2H3
charge 0 multiplicity 1
22 atoms
O  1.788493 0.926318 -1.455369
O  2.140107 0.873617 0.839037
N  0.61486 -1.57385 1.023242
C  -0.8871 -0.193141 -0.459944
C  0.558452 -0.755912 -0.193815
C  -1.402749 0.638849 0.746382
C  -1.825846 -1.369488 -0.806105
C  -2.676882 1.454075 0.43276
C  1.569625 0.403985 -0.171434
H  -0.808411 0.478843 -1.339328
H  0.816017 -1.39153 -1.06146
H  -0.610187 1.338448 1.082193
H  -1.602824 -0.046146 1.59429
H  -1.506892 -1.873333 -1.738155
H  -1.806263 -2.112105 0.010861
H  -2.864779 -1.024997 -0.952184
H  -2.505471 2.147012 -0.412819
H  -2.983931 2.058003 1.306248
H  -3.526937 0.800613 0.165773
H  0.613406 -1.012192 1.881825
H  1.382542 -2.252233 1.030392
H  2.426171 1.689664 -1.398591
