program: Orca
programVersion: 5.0.2
elementType: Cl O O O O N N N C C C C C C C C C C C C C C C C C C C H H H H H H H H H H H H H H H H H H H H
charge: 0
multiplicity: 1
keywords: wb97x-d3
keywords: def2-TZVPP
keywords: def2/J RIJCOSX
keywords: DEFGRID2
keywords: scfconv7
keywords: smallprint printgap noloewdin
keywords: NOSOSCF
formula: C19H20ClN3O4
InChI: InChI=1/C19H20ClN3O4/c1-12-3-2-4-14(13-5-6-13)17(12)27-18-15(11-16(20)21-22-18)26-19(24)23-7-9-25-10-8-23/h2-4,11,13H,5-10H2,1H3
47 atoms
Cl -5.306843 0.207853 0.784892
O  0.300519 -0.482071 0.32559
O  3.903968 2.512991 -0.870781
O  -0.672748 1.906491 -0.3837
O  0.098819 2.249288 1.697697
N  1.247325 3.032269 -0.11102
N  -1.783083 -1.2821 0.851435
N  -3.088573 -1.101501 0.950335
C  -0.147691 -2.231092 -1.855374
C  0.337883 -2.450917 -3.254111
C  0.22227 -1.059276 -2.71417
C  0.691375 -2.613697 -0.687681
C  0.84807 -1.751407 0.392989
C  1.329658 -3.847855 -0.616967
C  1.607982 -2.054377 1.51588
C  2.092797 -4.18932 0.489369
C  2.232514 -3.298281 1.542756
C  1.758057 -1.069654 2.635323
C  2.357642 3.55353 0.674283
C  1.595959 2.873207 -1.518214
C  3.568865 2.65656 0.493263
C  2.83062 1.993593 -1.624442
C  -1.015249 -0.313447 0.438494
C  0.255725 2.384001 0.506355
C  -1.5122 0.958402 0.090744
C  -2.854269 1.154269 0.190159
C  -3.598171 0.052912 0.631711
H  -1.213583 -2.377266 -1.704424
H  1.333781 -2.854756 -3.389688
H  -0.380883 -2.782036 -3.992503
H  -0.575849 -0.424729 -3.078553
H  1.143148 -0.534389 -2.489797
H  1.22726 -4.542979 -1.441146
H  2.585455 -5.152244 0.528945
H  2.832686 -3.568619 2.403068
H  2.303284 -1.515043 3.466221
H  0.793431 -0.731587 3.017017
H  2.309312 -0.18119 2.319716
H  2.577962 4.564325 0.322061
H  2.086832 3.620676 1.725151
H  0.778226 2.442879 -2.089186
H  1.799532 3.863811 -1.932004
H  4.433137 3.090794 0.998256
H  3.368527 1.6763 0.949665
H  3.158155 1.936904 -2.663692
H  2.58172 0.975759 -1.291276
H  -3.315839 2.098265 -0.065528
elementType: Cl O N C H
totalener: -1661.50381263 hartree
nucrepener: 2780.20971872 hartree
electener: -4441.71353135 hartree
oneelecener: -7800.68610141 hartree
twoeener: 3358.97257006 hartree
cpcmener: -0.03514323 hartree
kineticenergy: 1655.79927383 hartree
xcener: -135.698092179704 hartree
chargesum: -0.0000000
charge: -0.055705 -0.276856 -0.383139 -0.330768 -0.479840 -0.119542 -0.124216 -0.239974 -0.038292 -0.182078 -0.179858 0.046241 0.134967 -0.187412 -0.043507 -0.146108 -0.145496 -0.248844 -0.069280 -0.071190 0.033901 0.013568 0.275832 0.433136 0.196430 -0.147014 0.159333 0.099545 0.092185 0.094625 0.090936 0.091079 0.145122 0.154773 0.139451 0.101060 0.105825 0.098167 0.105637 0.103586 0.109846 0.109253 0.105224 0.083626 0.110793 0.082338 0.152641
qa: -0.0557 -0.2769 -0.3831 -0.3308 -0.4798 -0.1195 -0.1242 -0.2400 -0.0383 -0.1821 -0.1799 0.0462 0.1350 -0.1874 -0.0435 -0.1461 -0.1455 -0.2488 -0.0693 -0.0712 0.0339 0.0136 0.2758 0.4331 0.1964 -0.1470 0.1593 0.0995 0.0922 0.0946 0.0909 0.0911 0.1451 0.1548 0.1395 0.1011 0.1058 0.0982 0.1056 0.1036 0.1098 0.1093 0.1052 0.0836 0.1108 0.0823 0.1526
va: 1.2458 2.0965 1.9464 2.0736 2.0267 3.1729 2.8874 2.9524 3.6774 3.9498 3.8843 3.6701 3.7332 3.9189 3.8113 3.9087 3.8871 3.9217 3.8523 3.8548 3.9412 3.9609 4.0949 4.3239 3.8730 4.0666 4.1818 1.0122 1.0176 1.0167 1.0207 1.0205 0.9995 0.9914 1.0016 1.0074 1.0017 0.9961 1.0084 1.0325 1.0204 1.0089 0.9995 1.0054 1.0007 1.0128 1.0056
dispcorr: -0.028010879 hartree
energy: -1661.531823508566
dipole: 35.11195 -33.63129 1.48066 -0.72973 2.30156 1.57184 -9.96510 8.20881 -1.75629
magnitude: 2.78345 au
magnitude: 7.07496 debye
