program: Orca
programVersion: 5.0.2
elementType: Cl O O O O N N N C C C C C C C C C C C C C C C C C C C H H H H H H H H H H H H H H H H H H H H
charge: 0
multiplicity: 1
keywords: wb97x-d3
keywords: def2-TZVPP
keywords: def2/J RIJCOSX
keywords: DEFGRID2
keywords: scfconv7
keywords: smallprint printgap noloewdin
keywords: NOSOSCF
formula: C19H20ClN3O4
InChI: InChI=1/C19H20ClN3O4/c1-12-3-2-4-14(13-5-6-13)17(12)27-18-15(11-16(20)21-22-18)26-19(24)23-7-9-25-10-8-23/h2-4,11,13H,5-10H2,1H3
47 atoms
Cl -5.013614 0.497619 1.058409
O  0.064121 -1.142382 -0.85887
O  3.454714 4.434666 -1.135304
O  -0.279921 1.458414 -0.576959
O  -0.237762 2.467574 1.441875
N  1.416497 2.820283 -0.083241
N  -2.059172 -1.613546 -0.141589
N  -3.234861 -1.220548 0.304399
C  0.527598 -2.176677 1.75434
C  1.28826 -0.90377 1.983061
C  1.581479 -2.111191 2.816661
C  0.738215 -2.982307 0.521684
C  0.439499 -2.466853 -0.735505
C  1.210734 -4.2881 0.584391
C  0.591008 -3.192952 -1.909882
C  1.380367 -5.039414 -0.566404
C  1.073952 -4.49223 -1.801848
C  0.241555 -2.589727 -3.237924
C  2.182251 3.69587 0.787277
C  2.132155 2.410049 -1.281722
C  2.717335 4.865727 -0.020762
C  2.672396 3.642277 -1.988955
C  -1.121598 -0.74191 -0.397863
C  0.273053 2.275051 0.371271
C  -1.302473 0.643668 -0.229721
C  -2.514871 1.059451 0.237466
C  -3.454393 0.051504 0.483104
H  -0.49737 -2.18289 2.11394
H  2.025469 -0.621591 1.241886
H  0.768907 -0.068635 2.435612
H  1.26195 -2.116063 3.850294
H  2.515957 -2.629194 2.640835
H  1.444366 -4.713044 1.55241
H  1.750796 -6.053823 -0.501459
H  1.203242 -5.082348 -2.700683
H  -0.809062 -2.297934 -3.280405
H  0.416396 -3.302424 -4.042305
H  0.834285 -1.698908 -3.450197
H  1.549332 4.053715 1.596348
H  3.012083 3.136419 1.234424
H  2.959829 1.747725 -1.00199
H  1.481474 1.856393 -1.9527
H  1.877502 5.505148 -0.33148
H  3.384837 5.468408 0.59691
H  1.829877 4.220675 -2.397164
H  3.306052 3.339284 -2.823763
H  -2.74662 2.099501 0.410293
totalener: -1661.47551398 hartree
nucrepener: 2705.19053209 hartree
electener: -4366.66604606 hartree
oneelecener: -7650.20875693 hartree
twoeener: 3283.54271087 hartree
kineticenergy: 1655.83749244 hartree
xcener: -135.700652238318 hartree
chargesum: -0.0000000
charge: -0.048824 -0.296345 -0.310700 -0.320203 -0.398670 -0.123841 -0.084062 -0.189304 -0.036366 -0.161863 -0.152425 0.073779 0.158755 -0.183016 -0.030705 -0.107211 -0.117772 -0.235782 -0.071521 -0.084040 0.010607 0.023382 0.228466 0.402128 0.132853 -0.098219 0.138228 0.096016 0.072212 0.091667 0.080439 0.076721 0.122422 0.122352 0.103970 0.101212 0.082749 0.095971 0.108194 0.095522 0.090530 0.101281 0.070382 0.088687 0.069563 0.089549 0.123232
qa: -0.0488 -0.2963 -0.3107 -0.3202 -0.3987 -0.1238 -0.0841 -0.1893 -0.0364 -0.1619 -0.1524 0.0738 0.1588 -0.1830 -0.0307 -0.1072 -0.1178 -0.2358 -0.0715 -0.0840 0.0106 0.0234 0.2285 0.4021 0.1329 -0.0982 0.1382 0.0960 0.0722 0.0917 0.0804 0.0767 0.1224 0.1224 0.1040 0.1012 0.0827 0.0960 0.1082 0.0955 0.0905 0.1013 0.0704 0.0887 0.0696 0.0895 0.1232
va: 1.2482 2.1183 1.9995 2.1007 2.1063 3.1550 2.8911 2.9627 3.7025 3.8744 3.9468 3.6902 3.8131 3.9998 3.8454 3.9621 3.9567 3.9337 3.8558 3.8911 3.9783 3.9613 4.1269 4.2878 3.9386 4.0296 4.1747 1.0142 1.0207 1.0363 1.0215 1.0215 1.0055 1.0018 1.0097 1.0003 1.0083 0.9964 1.0323 1.0073 1.0052 1.0258 1.0051 1.0005 1.0076 0.9997 1.0241
dispcorr: -0.025566702 hartree
energy: -1661.501080678787
dipole: 33.88557 -32.40775 1.47782 0.71520 0.26689 0.98208 -5.23595 4.50575 -0.73020
magnitude: 1.91876 au
magnitude: 4.87710 debye
